program: Gaussian 09
title: 000257466
version: EM64L-G09RevD.01
frameworkgroup: C1[X(C8H6BrClO3)]
method: RPBEPBE
basis: SDD
operation: Freq
keyword: #p
keyword: freq=noraman
keyword: PBEPBE/SDD
title: #p freq=noraman PBEPBE/SDD
converged: YES YES NO NO
title: Mulliken charges:
elementType: Br Cl O O O C C C C C C C C H H H H H H
charge: 0.030642 -0.042296 -0.302470 -0.356408 -0.207481 0.158876 0.268552 -0.232930 -0.272943 -0.219537 -0.187177 0.192837 -0.497024 0.302665 0.280947 0.362360 0.233066 0.244281 0.244042
chargesum: 0.00000
title: Mulliken charges with hydrogens summed into heavy atoms:
elementType: Br Cl O O O C C C C C C C C
charge: 0.030642 -0.042296 -0.302470 0.005952 -0.207481 0.158876 0.268552 0.069735 -0.272943 -0.219537 0.093769 0.192837 0.224365
polarizability: 1.66140888e+02 -4.67850602e+00 1.63123962e+02 -7.29710887e-02 -3.77204207e-03 4.90236874e+01
1716.lowfreq: -5.7711 -4.8552 0.0012 0.0015 0.0021 4.3070 5.9216 72.2281 99.4389
frequency: 4.3287 72.2278 99.4365 102.5558 107.4236 153.6978 155.4257 205.4977 238.8245 272.3835 303.8598 324.9164 329.5372 371.2621 405.6891 466.5864 492.6665 549.9911 570.0611 653.7537 673.7174 695.1942 756.8489 785.5569 818.7563 872.8463 930.3360 934.9514 1045.7752 1102.8779 1116.0204 1134.5367 1145.6923 1220.4533 1227.6079 1284.8892 1371.5701 1387.9848 1424.7442 1446.8245 1451.5595 1464.5402 1567.4374 1585.9531 1638.4075 3004.8004 3106.1025 3149.0511 3182.9149 3198.9687 3460.3546
redmass: 6.6388 5.5340 1.4048 6.6889 3.2560 4.8822 14.1952 4.5104 7.0545 13.7701 7.1372 5.8118 8.4565 9.3041 8.8061 3.2678 1.2656 3.9623 4.9602 9.9387 8.1079 7.8647 6.9428 6.7853 7.1760 1.3938 1.4100 8.4250 5.0919 2.3780 1.2622 2.1150 1.4773 2.9138 1.8044 1.9363 3.8051 5.7094 1.1806 3.8698 1.0493 1.0518 7.4589 7.6965 10.7184 1.0296 1.1045 1.1047 1.0938 1.0926 1.0646
irintensity: 1.6325 0.7945 0.5681 0.5028 0.2248 4.6632 0.3387 1.1074 4.1593 2.9159 6.4278 12.1602 0.0185 2.9532 3.0230 4.3417 139.1423 18.3786 16.9183 85.8913 0.0101 37.5184 13.6522 32.8760 2.9247 21.3343 9.0224 15.0338 101.8904 45.3196 0.0721 173.4364 77.7847 297.4293 77.5692 20.2845 118.2764 4.2225 28.7012 125.7810 14.5255 11.6271 30.5027 6.9078 189.1364 38.5626 25.9808 14.2433 1.0907 4.1251 75.0433
temp: 298.150 k
press: 1.00000 atm
elementType: 35 17 8 8 8 6 6 6 6 6 6 6 6 1 1 1 1 1 1
symmnumber: 1
zpe: 323394.9 jmol-1
zpe.correction: 0.123175 hartree
zpe.thermalcorrener: 0.136365 hartree
zpe.thermalcorrenthalpy: 0.137309 hartree
zpe.thermalcorrgfe: 0.079466 hartree
zpe.sumelectzpe: -1006.685424 hartree
zpe.sumelectthermal: -1006.672234 hartree
zpe.sumelectthermalent: -1006.671290 hartree
zpe.sumelectthermalfe: -1006.729133 hartree
dipole: 0.5969 -0.4749 -0.0179
dipole: 0.7630
quadrupole: -95.0775 -78.3193 -92.2383
quadrupole: 9.9416 0.0917 -0.0198
quadrupole: -6.5325 10.2258 -3.6933 9.9416 0.0917 -0.0198
hfenergy: -1006.8085989 hartree
pointgroup: C01 [X(C8H6Br1Cl1O3)]
dipole: 0.0913253 0.2858298 0.0086307 debye
dipolederiv: -0.1417367 -0.2056547 0.000616 -0.2413182 -0.6085747 -0.0015718 0.0000019 -0.0027648 -0.0179614 -0.4176427 0.3017083 0.0160233 0.2961066 -0.5326526 -0.0162757 0.015763 -0.0162439 -0.0398081 -1.3217899 0.3370669 0.04027 0.6899791 -0.8059754 -0.0345089 0.0503033 -0.0229224 -0.3025608 -0.127171 -0.3022329 -0.0108212 -0.1292237 -1.3074018 -0.0102531 -0.0085902 -0.0045496 -0.3529978 -0.8126922 -0.3030703 0.0087824 -0.0765901 -0.73274 -0.009385 0.0154911 -0.0018016 -0.2987616 -0.6751248 0.0846884 0.0213379 -0.2706856 -0.0753591 0.0066179 0.0156248 -0.0036969 -0.0212213 0.0038223 0.5004306 0.0107216 0.2023659 1.0039945 0.006728 0.0051204 -0.0025884 0.1139967 0.1113902 -0.172581 -0.0075295 0.1094783 -0.3073745 -0.0073938 -0.0018264 0.001509 -0.046396 0.5074482 -0.7964504 -0.0301553 -0.4902539 0.458118 0.023069 -0.0251878 0.0322694 -0.0983851 -0.081795 0.5058479 0.0052713 0.5607985 1.0547387 0.0014 0.0060648 0.003325 -0.1630617 -0.1151312 -0.0138521 0.0032289 -0.1685813 -0.2477677 0.0015024 0.0006782 -0.0033613 -0.0030394 1.9683441 -0.0385996 -0.0544197 -0.4623276 1.2018901 0.0406022 -0.0656466 0.0248937 0.2477402 0.7553387 -0.1402437 -0.01766 -0.0845493 0.2421506 0.0019945 -0.0180242 0.0045856 0.2800835 0.1529358 0.0513577 0.0007299 0.0546462 0.0753909 -0.0028961 0.0004592 -0.0031008 0.1582027 0.0260635 -0.0145601 0.003957 -0.0098722 0.1172827 -0.0003882 0.0040553 -0.0002628 0.1637031 0.2265011 0.1089237 0.0057006 0.0448994 0.4264941 -0.0004406 0.0048739 -0.0021958 0.368353 0.02885 0.0421011 0.0041088 0.1150986 -0.0860921 -0.010343 0.006229 -0.0078509 0.1219083 -0.0401096 0.0289141 0.0228009 -0.0691739 0.0572681 0.1035557 0.0653544 0.0646705 -0.0524273 -0.0475007 0.0262061 -0.0229631 -0.070797 0.0666102 -0.0920134 -0.0707442 -0.0599139 -0.0573671 unknown
polarizability: 160.7755279|3.2284513|168.357496|-3.3762827|1.7895961|49.1555132 unknown
InChI: InChI=1S/C8H6BrClO3/c1-13-8(12)5-2-4(9)3-6(10)7(5)11/h2-3,11H,1H3
charge 0 multiplicity 1
19 atoms
Br 2.134276 3.350916 0.026821
Cl 3.052978 -2.270386 -0.085259
O  -2.580961 0.942618 0.144484
O  0.030329 -2.457691 0.003537
O  -2.500012 -1.382881 0.086016
C  -0.419174 -0.06137 0.052487
C  0.497336 -1.157401 0.008221
C  0.085944 1.267838 0.05738
C  1.888242 -0.85749 -0.029327
C  1.466871 1.510013 0.019005
C  2.395657 0.447272 -0.025168
C  -1.897249 -0.287607 0.093503
C  -4.056618 0.835412 0.188963
H  -0.631299 2.089319 0.091857
H  3.472663 0.628056 -0.055136
H  0.796345 -3.094858 -0.028218
H  -4.411636 1.874529 0.232806
H  -4.372358 0.267935 1.080546
H  -4.430532 0.324174 -0.714119
