program: Gaussian 09
title: 000257465
version: EM64L-G09RevD.01
frameworkgroup: C1[X(C13H14Cl2N2O3)]
method: RPBEPBE
basis: SDD
operation: Freq
keyword: #p
keyword: freq=noraman
keyword: PBEPBE/SDD
title: #p freq=noraman PBEPBE/SDD
converged: YES YES NO NO
title: Mulliken charges:
elementType: Cl Cl O O O N N C C C C C C C C C C C C C H H H H H H H H H H H H H H
charge: -0.056161 -0.070089 -0.214911 -0.221389 -0.411774 -0.172373 -0.075445 -0.415663 -0.508590 -0.512563 0.193723 0.183556 -0.443972 0.380409 -0.625403 0.220224 -0.285161 -0.261529 -0.150375 -0.266555 0.254207 0.256294 0.271838 0.264012 0.264069 0.271081 0.256084 0.242067 0.229553 0.219405 0.256312 0.282442 0.280967 0.365709
chargesum: 0.00000
title: Mulliken charges with hydrogens summed into heavy atoms:
elementType: Cl Cl O O O N N C C C C C C C C C C C C C
charge: -0.056161 -0.070089 -0.214911 -0.221389 -0.046066 -0.172373 -0.075445 0.094838 0.027260 0.022588 0.193723 0.183556 0.054179 0.380409 0.079867 0.220224 -0.002719 -0.261529 -0.150375 0.014412
polarizability: 2.08883686e+02 1.14941023e+01 1.89786821e+02 -2.71615346e+01 -3.72005193e+00 1.32950062e+02
1716.lowfreq: -5.4704 -2.1607 -0.0022 -0.0017 -0.0015 6.2419 12.7201 25.2914 37.8266
frequency: 11.1505 25.1042 37.7006 47.2596 69.7423 82.2310 88.4946 103.1602 108.9837 122.2531 141.9664 166.9474 179.2660 207.9577 222.9983 272.9012 282.0151 312.3809 332.8575 352.3491 376.9572 391.0946 444.4932 459.1784 459.9275 487.3094 539.2471 540.0339 543.2953 553.9399 555.1210 590.7874 617.2521 652.4124 691.5834 699.8546 703.6867 811.1447 821.7174 841.5584 847.5275 866.6928 888.8150 902.6607 970.5723 976.7333 1008.6341 1022.6658 1049.9909 1064.2006 1081.3597 1120.7242 1122.5615 1143.0157 1160.0586 1177.8410 1203.0845 1208.0976 1216.4729 1232.5546 1263.8000 1280.7829 1289.9075 1296.2753 1343.3667 1368.0159 1382.8789 1387.7105 1400.3809 1409.7959 1429.8539 1435.6108 1437.6961 1447.8035 1453.8148 1454.4954 1474.7999 1506.5125 1580.0723 1601.4195 1622.0186 1688.4670 2935.9312 2961.0432 2995.9067 3015.8965 3022.9725 3025.0579 3034.3761 3078.9086 3086.7235 3095.0400 3096.2492 3182.7671 3187.6560 3500.6063
redmass: 7.2556 7.0460 7.6626 2.7096 1.6498 5.7873 1.9700 5.9103 3.5907 4.8426 6.0807 6.1703 6.9787 4.6007 4.0978 7.2268 3.6559 7.2303 7.2101 16.0745 4.5943 4.5440 2.6385 1.1934 2.2435 4.2808 5.0247 4.2407 3.4604 3.2061 4.2387 5.1594 5.5662 6.0224 9.3429 5.4277 5.4582 6.2916 1.6004 4.7202 1.3749 4.6332 1.5640 2.0176 3.6766 2.7444 2.2091 2.5874 2.8495 2.0791 1.8818 2.5290 1.2786 1.2239 3.0298 2.0218 1.5988 1.1140 1.8642 2.0907 1.8052 2.9241 1.5360 2.1641 1.5423 1.9253 1.7888 3.9070 1.4247 2.3350 1.2341 1.1874 1.0914 2.0362 1.1134 1.2479 1.0957 1.0649 7.6380 7.6907 11.9980 11.3873 1.0377 1.0626 1.1002 1.0592 1.0984 1.0595 1.0634 1.1031 1.1053 1.0966 1.1016 1.0908 1.0938 1.0649
irintensity: 0.0739 0.1410 0.8377 1.0671 0.8064 3.1466 0.1760 8.2213 2.2326 3.0038 1.5474 5.2615 1.7974 6.1876 4.1870 0.9972 20.9683 7.9325 3.4418 4.6988 10.8767 7.9442 9.6722 116.6560 11.9608 1.6182 14.2643 7.5037 0.6555 11.9014 7.3476 12.0000 9.8726 31.4479 75.7971 34.1911 6.3039 15.5083 16.4349 12.5296 24.3708 26.8057 13.9345 5.4515 2.4310 48.3105 0.2219 25.2237 50.3128 59.2009 78.8992 92.9162 3.8718 0.9267 96.3910 39.6037 103.4900 0.0908 97.8451 90.7290 57.9473 112.3791 11.0611 120.7675 10.0970 23.7456 18.3250 55.2570 26.4597 24.2952 46.0831 88.9878 10.4131 65.7047 14.1348 27.1394 3.0472 10.6780 19.3247 12.6767 516.9821 20.4601 91.3170 28.4856 50.9913 31.7209 6.7356 12.5664 2.2331 0.0721 1.4045 11.0408 8.8373 1.2678 0.9379 66.6025
temp: 298.150 k
press: 1.00000 atm
elementType: 17 17 8 8 8 7 7 6 6 6 6 6 6 6 6 6 6 6 6 6 1 1 1 1 1 1 1 1 1 1 1 1 1 1
symmnumber: 1
zpe: 663850.8 jmol-1
zpe.correction: 0.252847 hartree
zpe.thermalcorrener: 0.273056 hartree
zpe.thermalcorrenthalpy: 0.274000 hartree
zpe.thermalcorrgfe: 0.200646 hartree
zpe.sumelectzpe: -1757.612279 hartree
zpe.sumelectthermal: -1757.592071 hartree
zpe.sumelectthermalent: -1757.591126 hartree
zpe.sumelectthermalfe: -1757.664481 hartree
dipole: -0.1869 -0.0340 0.3748
dipole: 0.4202
quadrupole: -126.3335 -124.8580 -140.1061
quadrupole: 4.6166 7.4553 7.0159
quadrupole: 4.0990 5.5745 -9.6735 4.6166 7.4553 7.0159
hfenergy: -1757.8651269 hartree
pointgroup: C01 [X(C13H14Cl2N2O3)]
dipole: 0.0422526 -0.0605407 0.1479376 debye
polarizability: 195.510205|-8.7887273|176.924635|40.6135121|19.6785895|159.1857287 unknown
InChI: InChI=1S/C13H14Cl2N2O3/c1-16(7-17-11(18)2-3-12(17)19)6-8-4-9(14)5-10(15)13(8)20/h4-5,20H,2-3,6-7H2,1H3
charge 0 multiplicity 1
34 atoms
Cl 4.761677 -1.200082 1.195044
Cl 0.640439 -2.636381 -2.307464
O  -1.823812 -0.72229 2.253033
O  -3.483369 0.659195 -1.905621
O  2.907795 1.173683 1.776355
N  -2.559318 0.249719 0.228268
N  -0.859278 2.068038 -0.004898
C  -2.131866 1.669374 0.530153
C  -2.841374 -2.111334 0.430583
C  -3.393327 -1.654385 -0.941881
C  -2.340814 -0.83328 1.115515
C  -3.182048 -0.135441 -0.98048
C  0.372294 1.784867 0.722939
C  1.153807 0.54845 0.249518
C  -0.755493 2.719007 -1.319097
C  2.424099 0.273805 0.824061
C  0.639708 -0.339464 -0.717462
C  3.129125 -0.883469 0.419293
C  1.366288 -1.486784 -1.084011
C  2.623225 -1.788354 -0.530427
H  -2.126731 1.725708 1.633649
H  -2.932279 2.310066 0.122789
H  -1.998402 -2.818204 0.341394
H  -3.601091 -2.590328 1.071288
H  -4.46583 -1.873646 -1.078585
H  -2.857401 -2.108404 -1.793476
H  0.139337 1.643868 1.796403
H  1.05123 2.661084 0.672619
H  -0.0929 2.160077 -2.011608
H  -0.3536 3.749984 -1.227795
H  -1.751883 2.76331 -1.788408
H  -0.328724 -0.120374 -1.172556
H  3.183032 -2.680379 -0.819374
H  3.791982 0.872263 2.11674
