program: Gaussian 09
title: 000257464
version: EM64L-G09RevD.01
frameworkgroup: C1[X(C15H13Br2NO)]
method: RPBEPBE
basis: SDD
operation: Freq
keyword: #p
keyword: freq=noraman
keyword: PBEPBE/SDD
title: #p freq=noraman PBEPBE/SDD
converged: YES YES NO NO
title: Mulliken charges:
elementType: Br Br O N C C C C C C C C C C C C C C C H H H H H H H H H H H H H
charge: 0.038625 0.008626 -0.227754 -0.127477 -0.458116 -0.495230 0.343037 -0.291740 0.309564 0.454001 -0.326290 -0.397321 -0.228558 -0.367900 -0.446369 -0.168508 -0.226797 -0.217758 -0.242117 0.262087 0.218099 0.224440 0.205436 0.232925 0.208620 0.254149 0.269996 0.231698 0.272689 0.229902 0.227419 0.230621
chargesum: 0.00000
title: Mulliken charges with hydrogens summed into heavy atoms:
elementType: Br Br O N C C C C C C C C C C C C C C C
charge: 0.038625 0.008626 -0.227754 -0.127477 0.022070 -0.065354 0.343037 0.149805 0.309564 0.454001 -0.072141 -0.397321 -0.228558 -0.097905 -0.214671 0.104182 0.003106 0.009662 -0.011496
polarizability: 2.42010658e+02 -1.09122452e+01 2.19622510e+02 2.33258716e+01 3.20049064e+00 1.41709811e+02
1716.lowfreq: -4.7707 -2.7140 -0.0005 -0.0005 -0.0003 5.4108 13.3496 22.8945 35.7068
frequency: 13.3025 22.8845 35.6889 85.3312 89.5993 112.8909 117.8890 137.2462 167.8697 193.8016 207.9176 237.2804 283.4258 301.4190 319.7194 325.9620 353.6112 405.9770 423.8390 466.3109 479.9608 501.3890 542.6293 552.2037 593.7608 615.8482 633.0951 678.5563 706.7498 723.3586 748.2194 772.3954 803.2712 860.5253 866.1002 871.1413 875.0787 882.4307 915.0660 929.0836 976.7299 985.3822 989.7278 991.5972 1004.5510 1024.9044 1049.3817 1080.3580 1089.7770 1133.1349 1144.3787 1171.6468 1181.5258 1190.3606 1199.3726 1210.1127 1213.1601 1234.5362 1261.3183 1296.0432 1310.3733 1339.9520 1359.6900 1366.6413 1377.9463 1391.5578 1403.4294 1434.0295 1442.0923 1460.5730 1467.9451 1480.2162 1483.9400 1555.9540 1594.4132 1596.1293 1614.2975 2843.4719 2871.8848 2883.2955 2994.4649 3035.9830 3104.1555 3112.1101 3125.7288 3137.1679 3147.9391 3151.7172 3163.7656 3182.7941
redmass: 7.1012 6.8917 3.8409 5.6592 5.6334 16.2748 7.6227 4.9313 3.6514 5.1020 4.1050 6.8174 4.1797 3.8517 2.8047 5.6028 3.9772 2.8609 3.7785 3.7690 3.9766 4.8969 5.8415 4.4306 5.2438 6.3394 7.8319 5.3197 2.0855 5.6073 1.6025 5.9012 4.2250 1.2919 1.9532 1.7036 2.2457 2.9127 1.4469 6.0563 1.8791 1.3975 4.0169 2.0087 1.3699 2.1852 1.9670 1.5957 2.0359 4.0775 1.9907 1.0598 1.1249 1.2222 1.6342 2.4233 1.5982 1.9557 1.6661 1.5477 1.5045 1.3398 1.8100 7.4376 2.2204 3.2687 2.6828 2.7183 2.0578 1.1327 1.1351 1.3060 1.7134 7.8076 8.0127 6.1934 6.0780 1.0711 1.0695 1.0710 1.0881 1.0865 1.0933 1.0878 1.0860 1.0910 1.0958 1.0926 1.1014 1.0933
irintensity: 0.0451 0.2012 0.0918 0.4640 1.7954 0.4957 0.4419 1.3390 1.4830 1.0159 0.9845 6.0025 0.0685 0.2706 10.6750 0.2172 9.3163 0.1187 3.6014 6.4578 4.9839 3.9616 8.1682 9.2112 3.9469 0.3596 56.2196 0.4551 38.2506 15.5844 46.9892 43.2932 12.1915 5.1277 63.0192 9.6142 12.9080 40.7173 33.8564 90.0722 13.7761 0.9354 0.6565 0.4556 1.3492 16.6720 20.8482 10.2583 4.0698 85.0034 125.8819 0.6519 1.4439 10.0072 43.7664 41.5877 24.4763 48.0402 8.9232 21.9926 6.7695 14.8910 47.6633 10.7337 18.2402 2.3820 24.2409 182.0169 13.6293 6.4954 25.5193 16.8150 9.7756 46.2493 1.5571 1.1305 4.8212 54.2187 41.8335 191.5921 17.0772 7.8092 22.3744 9.5320 0.0859 12.1170 32.2645 1.7502 25.0358 0.0863
temp: 298.150 k
press: 1.00000 atm
elementType: 35 35 8 7 6 6 6 6 6 6 6 6 6 6 6 6 6 6 6 1 1 1 1 1 1 1 1 1 1 1 1 1
symmnumber: 1
zpe: 632313.0 jmol-1
zpe.correction: 0.240835 hartree
zpe.thermalcorrener: 0.257914 hartree
zpe.thermalcorrenthalpy: 0.258858 hartree
zpe.thermalcorrgfe: 0.191747 hartree
zpe.sumelectzpe: -734.911504 hartree
zpe.sumelectthermal: -734.894425 hartree
zpe.sumelectthermalent: -734.893481 hartree
zpe.sumelectthermalfe: -734.960593 hartree
dipole: -4.1742 0.4133 -2.2144
dipole: 4.7432
quadrupole: -122.9171 -132.6076 -122.8892
quadrupole: -1.9511 6.1410 4.0750
quadrupole: 3.2209 -6.4696 3.2488 -1.9511 6.1410 4.0750
hfenergy: -735.1523392 hartree
pointgroup: C01 [X(C15H13Br2N1O1)]
dipole: 1.4987876 -0.0542802 1.1104737 debye
polarizability: 234.0549584|6.1085866|218.2918187|38.0311254|3.9655863|150.9962016 unknown
InChI: InChI=1S/C15H13Br2NO/c16-13-6-12-9-18(8-11-4-2-1-3-5-11)10-19-15(12)14(17)7-13/h1-7H,8-10H2
charge 0 multiplicity 1
32 atoms
Br -4.03136 -2.260283 -1.724856
Br -4.160286 3.402484 -0.442757
O  -1.408795 -2.11881 -0.130281
N  0.604163 -1.109135 0.734778
C  -0.01164 0.18699 1.067555
C  1.99515 -1.310566 1.176408
C  -1.376219 0.29984 0.39365
C  -0.322482 -2.208148 0.887567
C  -1.982447 -0.845863 -0.197511
C  2.986531 -0.400211 0.450768
C  -2.031743 1.549334 0.322253
C  -3.213962 -0.699994 -0.887194
C  -3.261804 1.659383 -0.349724
C  2.827326 -0.115575 -0.928482
C  4.1040 0.130813 1.139413
C  -3.864956 0.545438 -0.970663
C  3.773913 0.682801 -1.607251
C  5.056249 0.925877 0.460465
C  4.89366 1.203845 -0.916101
H  0.647933 0.992881 0.699013
H  -0.116623 0.330014 2.174038
H  2.253966 -2.36818 0.966768
H  2.113502 -1.16617 2.278281
H  0.173301 -3.171277 0.697328
H  -0.841936 -2.228556 1.876948
H  -1.567989 2.43093 0.77629
H  1.952262 -0.518305 -1.451421
H  4.231176 -0.076634 2.209834
H  -4.816226 0.637446 -1.49958
H  3.64023 0.898099 -2.673463
H  5.917163 1.330826 1.004286
H  5.628144 1.822705 -1.443558
