program: Gaussian 09
title: 000257463
version: EM64L-G09RevD.01
frameworkgroup: C1[X(C13H9Cl3O2)]
method: RPBEPBE
basis: SDD
operation: Freq
keyword: #p
keyword: freq=noraman
keyword: PBEPBE/SDD
title: #p freq=noraman PBEPBE/SDD
converged: YES YES NO NO
title: Mulliken charges:
elementType: Cl Cl Cl O O C C C C C C C C C C C C C H H H H H H H H H
charge: -0.043871 0.005682 -0.065574 -0.413367 -0.379276 -0.705163 0.458374 0.389057 0.106597 -0.337020 -0.476997 -0.382605 -0.250210 -0.256392 -0.335913 0.449369 -0.119909 -0.209141 0.249451 0.245880 0.280452 0.273146 0.260360 0.258217 0.258293 0.371219 0.369342
chargesum: 0.00000
title: Mulliken charges with hydrogens summed into heavy atoms:
elementType: Cl Cl Cl O O C C C C C C C C C C C C C
charge: -0.043871 0.005682 -0.065574 -0.042148 -0.009934 -0.209832 0.458374 0.389057 0.106597 -0.056568 -0.203851 -0.122245 -0.250210 -0.256392 -0.077696 0.449369 -0.119909 0.049152
polarizability: 2.56548501e+02 -2.53334299e+01 1.56772046e+02 1.08410320e+01 3.68095559e+00 1.23381185e+02
1716.lowfreq: -5.8235 -4.3441 -0.0008 -0.0001 0.0010 4.1265 18.6527 26.0158 48.3199
frequency: 18.6248 25.9697 48.3192 100.5137 122.3823 139.3217 154.7364 166.5230 202.7438 204.2415 238.5489 278.6726 283.7348 329.4891 338.8588 353.6743 359.0252 398.2257 431.7305 447.7565 452.4726 453.4120 495.1222 510.1252 538.3703 551.3261 564.4758 628.8490 652.5598 712.7029 718.0674 742.1765 754.3152 777.2050 822.5462 857.7869 865.5584 888.1453 900.3643 908.8459 945.5500 952.0526 1050.1058 1077.7732 1096.3151 1142.1517 1154.6173 1175.0385 1184.2904 1205.9033 1233.1586 1255.4373 1287.1703 1296.3934 1313.3592 1382.9493 1388.9600 1402.8902 1414.3732 1454.5262 1472.8239 1475.9453 1562.6783 1580.8387 1604.2640 1620.1649 2977.0211 3031.4377 3149.1688 3154.5626 3160.0900 3162.8612 3182.2813 3493.4692 3496.0561
redmass: 10.7477 11.6692 7.3247 12.2452 7.6612 13.0393 7.3209 9.5966 7.5693 5.5925 4.0929 4.5030 6.1079 7.4549 4.6873 18.0384 13.3796 5.7961 3.1969 1.2189 2.8692 1.1299 5.1765 4.7795 4.5868 4.2807 4.2972 7.3937 5.6494 5.9279 4.8644 6.2981 5.1273 4.9399 1.4541 1.9991 1.7472 1.9189 1.4584 5.2272 1.4461 1.7709 3.2285 2.0541 1.8510 1.5432 1.4174 1.7028 1.5872 1.8636 1.7368 1.5987 2.1632 1.6074 1.8285 3.9038 5.4835 3.5514 3.7471 1.2597 3.8895 2.2951 6.3541 7.0475 8.0689 7.1328 1.0614 1.0991 1.0926 1.0922 1.0928 1.0887 1.0977 1.0657 1.0652
irintensity: 0.0657 0.3024 0.2010 0.0387 0.5004 0.7985 3.4742 0.3872 0.0530 0.8472 0.7176 2.9505 7.1824 0.8132 1.5944 2.8367 1.5349 11.1463 5.8263 90.7775 32.7341 118.9785 1.2912 32.1986 5.1516 13.0285 4.3902 23.1538 13.4551 4.4721 1.5139 42.9916 37.1858 30.2497 38.5525 25.0626 25.2730 10.2265 8.6871 20.4018 4.8419 20.1093 0.5528 7.9426 1.6633 178.9552 129.4338 29.4298 18.0788 26.6823 148.2306 8.4290 20.5631 11.8158 1.4319 49.0020 3.1162 14.7070 18.8744 27.7343 234.6836 49.8293 40.1264 1.5599 0.0535 0.6723 19.5169 6.4500 2.1369 0.2550 0.0489 1.5864 3.0236 294.1659 14.5196
temp: 298.150 k
press: 1.00000 atm
elementType: 17 17 17 8 8 6 6 6 6 6 6 6 6 6 6 6 6 6 1 1 1 1 1 1 1 1 1
symmnumber: 1
zpe: 484333.3 jmol-1
zpe.correction: 0.184473 hartree
zpe.thermalcorrener: 0.201144 hartree
zpe.thermalcorrenthalpy: 0.202088 hartree
zpe.thermalcorrgfe: 0.137984 hartree
zpe.sumelectzpe: -2030.129826 hartree
zpe.sumelectthermal: -2030.113155 hartree
zpe.sumelectthermalent: -2030.112211 hartree
zpe.sumelectthermalfe: -2030.176315 hartree
dipole: 1.9788 -2.2778 -1.2953
dipole: 3.2836
quadrupole: -129.3348 -130.5071 -123.5669
quadrupole: -5.1909 -4.0623 2.9768
quadrupole: -1.5319 -2.7042 4.2361 -5.1909 -4.0623 2.9768
hfenergy: -2030.3142991 hartree
pointgroup: C01[X(C13H9Cl3O2)]
dipole: 0.6456523 0.4217859 -1.0364039 debye
polarizability: 246.9878207|-15.4933858|123.6088167|-37.4451995|1.7092604|166.1050944 unknown
InChI: InChI=1S/C13H9Cl3O2/c14-9-1-2-12(17)8(6-9)3-7-4-10(15)13(18)11(16)5-7/h1-2,4-6,17-18H,3H2
charge 0 multiplicity 1
27 atoms
Cl 4.427935 -0.005484 -2.325121
Cl 2.628841 -0.223339 2.919337
Cl -5.312436 1.042643 1.606955
O  -0.908739 -1.936703 -1.229757
O  4.628534 -0.390495 0.70821
C  -0.693351 1.014718 -1.078051
C  0.709757 0.593526 -0.627133
C  -1.835104 0.226311 -0.446539
C  -1.898655 -1.192678 -0.567944
C  0.992759 0.37163 0.746795
C  1.763448 0.476147 -1.568535
C  -2.88736 0.890282 0.228683
C  3.054754 0.152503 -1.122702
C  2.293072 0.050617 1.165284
C  -2.994996 -1.917611 -0.051561
C  3.365037 -0.068704 0.242086
C  -3.970053 0.154604 0.743658
C  -4.044212 -1.245215 0.60845
H  -0.836529 2.086505 -0.843445
H  -0.74872 0.931482 -2.182358
H  0.191577 0.447571 1.488508
H  1.582033 0.648558 -2.634281
H  -2.862439 1.979336 0.339503
H  -3.01082 -3.004428 -0.171898
H  -4.894599 -1.801444 1.012408
H  -0.072128 -1.409639 -1.325673
H  5.272096 -0.443295 -0.048678
