program: Gaussian 09
title: 000257461
version: EM64L-G09RevD.01
frameworkgroup: C1[X(C12H16Br2N2O4)]
method: RPBEPBE
basis: SDD
operation: Freq
keyword: #p
keyword: freq=noraman
keyword: PBEPBE/SDD
title: #p freq=noraman PBEPBE/SDD
converged: YES YES NO NO
title: Mulliken charges:
elementType: Br Br O O O O N N C C C C C C C C C C C C H H H H H H H H H H H H H H H H
charge: 0.058834 0.023010 -0.271317 -0.284446 -0.300450 -0.295819 -0.372759 -0.651112 -0.642125 0.855211 -0.370506 -0.778592 -0.757654 0.426866 0.455227 0.067910 0.277021 -0.520391 -0.521910 -0.521647 0.242350 0.275397 0.241734 0.274321 0.288497 0.262046 0.234284 0.223992 0.250075 0.235293 0.234712 0.235902 0.228752 0.257828 0.299391 0.340075
chargesum: 0.00000
title: Mulliken charges with hydrogens summed into heavy atoms:
elementType: Br Br O O O O N N C C C C C C C C C C C C
charge: 0.058834 0.023010 -0.271317 -0.284446 -0.300450 -0.295819 -0.084262 -0.011646 -0.124378 0.855211 0.145549 -0.778592 -0.757654 0.426866 0.455227 0.067910 0.277021 0.199931 0.198170 0.200835
polarizability: 2.54503058e+02 -1.45293190e+00 2.40291265e+02 -1.30556873e+01 -1.88756798e+00 1.06701777e+02
1716.lowfreq: -7.3573 -5.1864 -0.9903 -0.0003 0.0002 0.0003 17.0301 23.0831 30.6597
frequency: 16.8231 23.0239 30.5850 37.6657 49.6798 59.7212 63.4479 71.9392 79.4201 87.5666 105.5239 139.0864 150.2896 152.4900 159.9317 172.9700 186.1395 218.9463 231.6756 237.0173 257.8859 273.9303 278.6657 295.8260 304.9857 322.4449 353.0295 383.4327 413.7398 424.2571 459.4359 469.3195 514.1450 535.4215 584.4984 597.3714 622.8568 664.8937 683.1261 709.3181 715.5064 780.2301 799.7122 825.8578 873.7093 887.0386 909.9528 951.8090 1005.5366 1018.9400 1032.7155 1039.3853 1077.6377 1107.3256 1110.0364 1111.2756 1134.4425 1140.8760 1152.8818 1156.9784 1162.3450 1197.0110 1286.8241 1298.6471 1307.6777 1320.6723 1326.7765 1357.2309 1370.0837 1383.8489 1426.7822 1431.4751 1434.5011 1450.3178 1459.7980 1461.7820 1463.7973 1472.1903 1473.6349 1478.4354 1481.1439 1502.6578 1529.8842 1558.3158 1600.1472 1651.1741 2978.2630 2980.1846 2982.6445 3008.5315 3021.5208 3075.8687 3078.6843 3085.8357 3086.7737 3095.5365 3126.8498 3128.3128 3131.4415 3542.2372 3555.3898 3701.8262
redmass: 7.7100 7.3250 4.3002 3.6493 3.6422 4.1631 4.1182 3.5521 4.0876 3.5397 5.3302 3.3602 3.8303 1.7038 1.2021 1.3818 2.1136 4.8739 2.2877 1.8850 4.6950 3.0285 7.2362 4.4047 5.6322 5.3398 3.2061 5.7671 7.1669 6.0877 1.1937 3.3782 1.1804 5.6019 5.2433 5.0724 3.9294 10.0098 6.5396 7.9634 9.2805 2.1253 2.7048 8.3703 8.1400 2.8778 7.2545 11.5188 6.1390 2.0701 5.1006 3.1990 2.5754 1.2402 1.2434 1.2407 2.5357 2.9105 1.3525 1.4479 2.1574 1.4797 1.3049 1.4739 6.0185 1.7517 4.4024 3.6705 1.2680 3.3005 1.2901 1.3758 1.2607 1.1179 1.0671 1.0536 1.0628 1.0581 1.1018 1.0549 1.0548 2.1190 7.7797 9.5517 1.3193 3.6294 1.0301 1.0317 1.0294 1.0611 1.0614 1.0990 1.1054 1.1037 1.1039 1.1045 1.1036 1.1028 1.1039 1.0492 1.0736 1.1038
irintensity: 3.1547 2.9961 15.7411 1.5788 5.4690 1.6160 2.2181 5.3730 3.8894 3.2594 4.7240 0.9640 1.6636 0.5176 0.5633 0.8739 2.1722 4.6685 6.4557 8.5661 16.1332 7.2730 1.5636 4.8805 8.3624 0.7660 0.5836 1.1166 2.0053 8.4866 420.0826 19.4704 23.3622 1.1069 5.8180 17.5314 1.8727 5.2250 4.5937 70.9122 18.8484 22.8471 18.5001 4.2465 6.5104 6.2033 53.0183 152.1909 30.3772 10.2936 18.4147 36.8185 56.7155 6.1320 3.4543 2.1315 12.3867 35.1636 3.0937 12.6212 18.2397 42.4949 13.5073 15.7699 124.8634 228.9747 5.2331 153.4782 3.9300 168.9310 15.7317 62.6134 15.7279 29.9732 9.8492 14.2141 1.0428 5.1118 12.5762 19.0608 28.0054 404.4390 0.2714 2.2770 98.8880 252.6933 51.8907 85.7345 54.2406 13.3925 30.8980 0.2145 22.8487 23.7734 19.7589 5.0206 21.8293 22.4482 16.2873 39.1771 7.9593 36.6554
temp: 298.150 k
press: 1.00000 atm
elementType: 35 35 8 8 8 8 7 7 6 6 6 6 6 6 6 6 6 6 6 6 1 1 1 1 1 1 1 1 1 1 1 1 1 1 1 1
symmnumber: 1
zpe: 710111.8 jmol-1
zpe.correction: 0.270467 hartree
zpe.thermalcorrener: 0.294344 hartree
zpe.thermalcorrenthalpy: 0.295288 hartree
zpe.thermalcorrgfe: 0.212434 hartree
zpe.sumelectzpe: -902.624375 hartree
zpe.sumelectthermal: -902.600499 hartree
zpe.sumelectthermalent: -902.599555 hartree
zpe.sumelectthermalfe: -902.682409 hartree
dipole: -1.2161 3.0015 1.3638
dipole: 3.5140
quadrupole: -102.3689 -135.7611 -135.2597
quadrupole: 25.4531 -7.4882 1.1510
quadrupole: 22.0943 -11.2979 -10.7965 25.4531 -7.4882 1.1510
hfenergy: -902.8948427 hartree
pointgroup: C01 [X(C12H16Br2N2O4)]
dipole: -0.4440036 1.1894106 0.5472492 debye
polarizability: 253.9477287|-1.7411466|240.3669512|-15.5970265|-1.2335405|107.1814215 unknown
InChI: InChI=1S/C12H16Br2N2O4/c1-18-9-7(13)6(4-5-16-12(15)17)8(14)10(19-2)11(9)20-3/h16H,4-5,15H2,1-3H3
charge 0 multiplicity 1
36 atoms
Br 0.977055 -2.669529 -0.531107
Br 0.117708 3.152389 -0.412947
O  -2.747641 2.232295 0.004524
O  -2.060122 -2.618482 -0.069353
O  -3.784418 -0.401507 0.296063
O  4.834389 -1.280929 0.386806
N  4.072553 0.93401 0.332364
N  6.353172 0.445352 -0.009169
C  1.857946 0.443593 -0.760453
C  0.382356 0.214282 -0.492092
C  2.672121 0.571513 0.565047
C  -0.167067 -1.093486 -0.366451
C  -0.520632 1.297693 -0.306005
C  -1.903447 1.120176 -0.04566
C  -1.539056 -1.315321 -0.100152
C  -2.410097 -0.203708 0.045806
C  5.067851 -0.041852 0.243831
C  -3.49312 2.437663 1.270145
C  -2.475931 -3.088289 1.275793
C  -4.544471 -0.866119 -0.894806
H  1.989719 1.368827 -1.348133
H  2.282053 -0.394138 -1.338491
H  2.20558 1.334157 1.215446
H  2.664076 -0.397022 1.092617
H  4.291261 1.911813 0.139089
H  -4.128395 1.563987 1.491553
H  -4.108699 3.332096 1.093659
H  -2.783191 2.625662 2.097497
H  -3.248327 -2.41985 1.696039
H  -1.597043 -3.138555 1.944724
H  -2.88345 -4.097512 1.115994
H  -4.496233 -0.102059 -1.691765
H  -5.581968 -0.990888 -0.549954
H  -4.13683 -1.827846 -1.252647
H  6.585467 1.433841 -0.073736
H  7.097034 -0.244158 -0.073783
