program: Gaussian 09
title: 000257460
version: EM64L-G09RevD.01
frameworkgroup: C1[X(C13H9Cl3O2)]
method: RPBEPBE
basis: SDD
operation: Freq
keyword: #p
keyword: freq=noraman
keyword: PBEPBE/SDD
title: #p freq=noraman PBEPBE/SDD
converged: YES YES NO NO
title: Mulliken charges:
elementType: Cl Cl Cl O O C C C C C C C C C C C C C H H H H H H H H H
charge: -0.055803 -0.011886 -0.022765 -0.384158 -0.405567 -0.718832 0.574844 0.540735 -0.486025 -0.391006 -0.452233 -0.362874 -0.242656 -0.242058 -0.267128 -0.351173 0.445313 0.362430 0.234874 0.236584 0.264079 0.274054 0.261043 0.246534 0.224950 0.365944 0.362778
chargesum: 0.00000
title: Mulliken charges with hydrogens summed into heavy atoms:
elementType: Cl Cl Cl O O C C C C C C C C C C C C C
charge: -0.055803 -0.011886 -0.022765 -0.018213 -0.042789 -0.247374 0.574844 0.540735 -0.221945 -0.116952 -0.191190 -0.116341 -0.242656 -0.242058 -0.267128 -0.126223 0.445313 0.362430
polarizability: 2.54633495e+02 -2.30753529e+01 1.55427989e+02 1.57195125e+01 3.68889620e+00 1.28006679e+02
1716.lowfreq: -4.1344 -3.6119 -0.0027 -0.0017 0.0004 1.1989 13.2296 14.6308 39.6719
frequency: 13.0022 14.5703 39.6671 100.3414 119.2303 140.3419 156.3936 166.3500 198.2160 203.7857 222.1382 260.0913 285.8116 325.1294 339.3348 347.1351 352.4059 378.3098 402.0701 438.0244 439.7990 475.8931 491.6220 495.4289 520.2329 550.9641 569.3034 630.1634 680.6032 712.7939 713.4285 741.8617 762.9295 776.8681 804.0567 855.2592 869.1015 887.2596 893.5621 912.6112 935.7638 960.0083 1032.2732 1048.9162 1117.0184 1145.0894 1162.1626 1184.9358 1196.4611 1213.9299 1236.5721 1263.5232 1284.4590 1292.7664 1306.5593 1386.3529 1388.4692 1401.5382 1406.6621 1461.1685 1477.5972 1499.3878 1569.0018 1581.4860 1609.8426 1622.7295 2978.0257 3024.0887 3116.3009 3145.3463 3149.4678 3154.7698 3162.2707 3494.8204 3581.8876
redmass: 10.1899 8.8211 7.5785 12.1541 7.1158 11.6735 7.7028 7.4985 12.2013 4.7550 5.6547 5.9548 5.0138 5.0122 3.2238 1.3009 17.1107 6.3853 5.9615 3.2231 1.1013 5.0934 5.3951 6.3902 4.6472 4.5039 3.6987 5.5756 6.6779 5.2734 4.2036 8.1461 3.7556 5.4393 1.5058 2.1626 2.0041 1.4969 1.6778 4.6273 1.3936 1.9259 3.2073 3.2391 1.5070 1.5605 1.1916 1.2259 1.8520 1.8673 1.7413 2.8527 1.7754 2.3987 1.4932 4.3813 5.0477 3.6930 3.1929 1.2616 2.9192 2.8024 6.4383 6.6769 8.2082 6.9241 1.0599 1.1006 1.0885 1.0930 1.0950 1.0922 1.0927 1.0649 1.0661
irintensity: 1.5472 0.7499 0.4169 0.0149 0.1763 0.8973 2.7224 1.4081 0.7365 0.5219 5.1147 2.0081 12.4818 3.6029 11.2354 120.2136 4.9912 0.9978 2.8453 7.7044 137.1582 15.6908 0.6694 22.2454 1.2215 6.3242 12.2234 17.7543 14.1431 6.0369 2.4686 60.3800 6.5748 37.8509 51.4519 45.6286 13.3900 3.0417 5.2045 19.2761 6.2168 28.0403 28.1157 0.5050 204.5339 191.1411 34.5151 6.8872 3.9107 16.9815 122.3676 62.4933 8.1770 23.6251 47.6970 14.2692 29.9337 28.0230 16.1441 44.2469 123.9401 77.0533 48.8349 9.8397 0.6624 11.9063 24.9264 9.3408 15.1101 6.3219 4.0556 1.2214 0.1658 69.1313 51.3650
temp: 298.150 k
press: 1.00000 atm
elementType: 17 17 17 8 8 6 6 6 6 6 6 6 6 6 6 6 6 6 1 1 1 1 1 1 1 1 1
symmnumber: 1
zpe: 483756.3 jmol-1
zpe.correction: 0.184253 hartree
zpe.thermalcorrener: 0.201119 hartree
zpe.thermalcorrenthalpy: 0.202063 hartree
zpe.thermalcorrgfe: 0.136513 hartree
zpe.sumelectzpe: -2030.124130 hartree
zpe.sumelectthermal: -2030.107264 hartree
zpe.sumelectthermalent: -2030.106320 hartree
zpe.sumelectthermalfe: -2030.171870 hartree
dipole: -0.3403 -0.2923 1.7360
dipole: 1.7930
quadrupole: -153.1124 -121.7056 -112.1197
quadrupole: 7.9684 -10.8610 2.3627
quadrupole: -24.1331 7.2736 16.8595 7.9684 -10.8610 2.3627
hfenergy: -2030.3083827 hartree
pointgroup: C01 [X(C13H9Cl3O2)]
dipole: -0.2245718 0.4808276 -0.4647384 debye
polarizability: 244.5988487|42.8397669|151.621224|-5.5186024|12.2122501|141.8480908 unknown
InChI: InChI=1S/C13H9Cl3O2/c14-9-4-7(1-2-12(9)17)3-8-5-10(15)13(18)11(16)6-8/h1-2,4-6,17-18H,3H2
charge 0 multiplicity 1
27 atoms
Cl 2.775374 -2.184745 -1.871365
Cl 4.67326 2.278242 0.831593
Cl -5.040101 -1.811108 1.059446
O  4.788021 -0.014381 -1.094496
O  -5.114665 0.03571 -1.290835
C  -0.222833 0.37065 1.776087
C  1.08122 0.273042 0.986245
C  -1.493234 0.276615 0.9333
C  2.133349 1.193217 1.214668
C  1.277645 -0.762368 0.03705
C  -2.537742 -0.60525 1.305428
C  -1.675725 1.088294 -0.214443
C  2.499546 -0.850325 -0.640818
C  3.350904 1.082146 0.518552
C  -3.72617 -0.667792 0.555082
C  -2.86641 1.026041 -0.964337
C  3.571927 0.055203 -0.430066
C  -3.911279 0.144724 -0.587909
H  -0.220503 1.326942 2.335538
H  -0.246029 -0.429473 2.541878
H  2.009504 2.004467 1.939227
H  0.480712 -1.482532 -0.170268
H  -2.431579 -1.248708 2.185506
H  -0.877918 1.770892 -0.527115
H  -2.991995 1.662952 -1.849602
H  4.787271 -0.785526 -1.723103
H  -5.12375 0.646469 -2.069344
