program: Gaussian 09
title: 000257459
version: EM64L-G09RevD.01
frameworkgroup: C1[X(C13H9Cl3O2)]
method: RPBEPBE
basis: SDD
operation: Freq
keyword: #p
keyword: freq=noraman
keyword: PBEPBE/SDD
title: #p freq=noraman PBEPBE/SDD
converged: YES YES NO NO
title: Mulliken charges:
elementType: Cl Cl Cl O O C C C C C C C C C C C C C H H H H H H H H H
charge: -0.012146 -0.056556 -0.007293 -0.386213 -0.400603 -0.693660 0.424134 0.409963 0.232968 -0.414836 -0.427340 -0.326976 -0.279324 -0.105076 -0.272859 -0.347505 -0.242883 0.364201 0.247467 0.246323 0.263804 0.271168 0.254477 0.229465 0.282238 0.379962 0.367100
chargesum: 0.00000
title: Mulliken charges with hydrogens summed into heavy atoms:
elementType: Cl Cl Cl O O C C C C C C C C C C C C C
charge: -0.012146 -0.056556 -0.007293 -0.006251 -0.033503 -0.199870 0.424134 0.409963 0.232968 -0.151032 -0.156172 -0.072499 -0.279324 -0.105076 -0.272859 -0.118040 0.039355 0.364201
polarizability: 2.55285752e+02 -2.48504572e+01 1.54035052e+02 1.18001199e+01 2.05326390e+00 1.29021802e+02
1716.lowfreq: -3.0776 -0.0025 -0.0023 0.0006 3.8303 8.2609 20.6141 29.8486 42.7701
frequency: 20.5436 29.8291 42.7675 107.0251 130.1557 139.3502 147.1072 168.2840 191.0648 213.7393 227.4535 268.2051 285.5708 330.0807 339.1316 358.3887 362.2779 378.0616 391.4029 436.6355 463.3561 481.4183 490.7851 514.4135 525.2608 557.1481 565.3327 636.7480 683.0997 687.8229 711.9750 731.8635 768.9248 806.6081 812.4587 854.5951 862.9219 873.2494 887.0719 908.8375 937.4739 955.8008 1032.7144 1087.7158 1116.4192 1131.3809 1163.2033 1170.5281 1186.2519 1209.4557 1239.8083 1267.0772 1276.7032 1287.4214 1308.6911 1381.6910 1387.6550 1403.8722 1409.6852 1447.1268 1465.7507 1497.5905 1567.0265 1575.5031 1609.0242 1619.6834 2978.6067 3031.9695 3120.5565 3144.0991 3151.3451 3156.5362 3184.6399 3452.5735 3581.9264
redmass: 10.3688 9.2786 8.2191 8.6630 7.3513 12.1509 12.4210 6.7333 9.9729 5.2378 5.6016 4.6323 4.8153 4.0933 7.9959 12.5520 1.1505 6.3748 9.4047 3.0922 2.8779 1.8231 2.6111 4.0269 4.8035 3.7658 4.2820 6.0285 6.0904 8.5882 4.2438 5.7544 4.2500 1.6256 5.4498 3.0735 1.4155 1.5363 1.6877 4.6742 1.4934 1.7207 3.2025 1.8290 1.5122 2.1087 1.1977 2.2010 1.5671 2.0111 1.3100 2.8621 1.6941 1.7632 1.6735 4.3753 5.2254 3.8452 4.2418 1.8317 1.5569 2.7712 7.3722 6.6710 7.7583 6.8241 1.0612 1.0993 1.0886 1.0922 1.0958 1.0927 1.0936 1.0661 1.0662
irintensity: 1.3138 0.6419 0.5772 1.3063 0.3059 0.3344 0.6591 3.2720 1.6012 1.0443 4.4468 4.9615 4.3015 0.5721 1.4805 3.6355 137.4672 2.8712 3.7327 7.8995 15.5166 70.1271 11.5028 12.7748 10.6611 8.8935 6.8277 11.2601 33.9140 32.4725 3.1960 16.2563 20.8785 22.0074 30.2462 31.6902 19.9691 12.2601 5.9501 49.4424 14.8768 15.7432 29.9522 7.4305 205.5156 66.5283 23.1265 103.6773 3.4108 69.6750 19.3112 67.5090 17.9007 18.2582 10.3849 17.9117 18.9526 14.7505 4.3602 77.8353 128.6266 93.3134 30.0722 14.4283 2.6421 15.0818 18.6494 6.8627 12.3317 1.6220 4.0596 1.0646 0.7899 345.5118 58.4905
temp: 298.150 k
press: 1.00000 atm
elementType: 17 17 17 8 8 6 6 6 6 6 6 6 6 6 6 6 6 6 1 1 1 1 1 1 1 1 1
symmnumber: 1
zpe: 484059.8 jmol-1
zpe.correction: 0.184369 hartree
zpe.thermalcorrener: 0.201081 hartree
zpe.thermalcorrenthalpy: 0.202025 hartree
zpe.thermalcorrgfe: 0.137950 hartree
zpe.sumelectzpe: -2030.125229 hartree
zpe.sumelectthermal: -2030.108516 hartree
zpe.sumelectthermalent: -2030.107572 hartree
zpe.sumelectthermalfe: -2030.171648 hartree
dipole: -1.4990 -2.9986 1.7962
dipole: 3.8033
quadrupole: -143.2459 -131.6687 -110.7564
quadrupole: 2.9645 -9.1496 0.4216
quadrupole: -14.6889 -3.1117 17.8006 2.9645 -9.1496 0.4216
hfenergy: -2030.3095977 hartree
pointgroup: C01 [X(C13H9Cl3O2)]
dipole: -0.8677766 0.8271433 -0.8954132 debye
polarizability: 239.0184436|32.429551|160.9937385|-34.8784569|-13.1486547|138.330424 unknown
InChI: InChI=1S/C13H9Cl3O2/c14-9-5-8(13(18)11(16)6-9)3-7-1-2-12(17)10(15)4-7/h1-2,4-6,17-18H,3H2
charge 0 multiplicity 1
27 atoms
Cl 3.356608 -3.039125 0.339835
Cl 4.641609 2.132766 -1.233723
Cl -4.780892 -1.128619 2.21187
O  0.79877 -1.802553 1.23469
O  -4.844977 -1.537956 -0.74561
C  -0.015387 1.028416 1.138645
C  1.304122 0.525892 0.562099
C  -1.264344 0.305904 0.621759
C  1.646627 -0.856426 0.659928
C  2.224323 1.425293 -0.024249
C  -2.30244 -0.062982 1.517142
C  -1.442435 0.042702 -0.761303
C  2.911752 -1.290384 0.197015
C  3.468871 0.956368 -0.481829
C  -3.47861 -0.670689 1.041543
C  -2.620173 -0.566213 -1.234924
C  3.836786 -0.397333 -0.376057
C  -3.656945 -0.931668 -0.338702
H  0.011141 0.946462 2.243996
H  -0.103882 2.107912 0.912804
H  1.971803 2.486871 -0.108431
H  -2.203091 0.131411 2.59077
H  -0.651616 0.312906 -1.469424
H  -2.740563 -0.765265 -2.307547
H  4.806782 -0.754665 -0.729611
H  -0.135682 -1.460868 1.272754
H  -4.854354 -1.683458 -1.724435
