program: Gaussian 09
title: 000257457
version: EM64L-G09RevD.01
frameworkgroup: C1[X(C13H9Cl3O2)]
method: RPBEPBE
basis: SDD
operation: Freq
keyword: #p
keyword: freq=noraman
keyword: PBEPBE/SDD
title: #p freq=noraman PBEPBE/SDD
converged: YES YES NO NO
title: Mulliken charges:
elementType: Cl Cl Cl O O C C C C C C C C C C C C C H H H H H H H H H
charge: -0.061251 -0.056468 -0.072384 -0.427406 -0.438045 -0.673970 0.407779 0.381438 0.230308 0.249111 -0.326057 -0.356160 -0.256020 -0.108496 -0.281102 -0.238449 -0.262264 -0.254894 0.246145 0.247317 0.292452 0.262276 0.233066 0.280990 0.256091 0.362935 0.363057
chargesum: 0.00000
title: Mulliken charges with hydrogens summed into heavy atoms:
elementType: Cl Cl Cl O O C C C C C C C C C C C C C
charge: -0.061251 -0.056468 -0.072384 -0.064471 -0.074988 -0.180508 0.407779 0.381438 0.230308 0.249111 -0.033605 -0.093884 -0.256020 -0.108496 -0.281102 -0.005383 0.018726 0.001198
polarizability: 2.03292490e+02 1.32116448e+01 2.11199378e+02 1.97559500e-01 5.74133539e+00 1.03923856e+02
1716.lowfreq: -7.4566 -2.8434 -0.0037 -0.0035 -0.0027 4.7085 14.3211 30.7813 40.8962
frequency: 14.1017 30.7753 40.8744 98.4849 115.2640 138.2506 147.2045 178.1157 201.7618 224.6983 241.3844 272.2926 286.1754 338.7994 341.2615 357.0471 370.6279 389.3308 449.5545 450.1189 460.8869 483.1490 500.1882 525.3229 534.6414 543.8912 551.7610 595.8499 626.1228 680.9850 704.9034 741.8877 773.2493 798.0405 805.8417 841.9784 848.0110 883.3168 902.1241 915.6218 930.3875 970.2049 1058.0044 1076.2961 1104.2317 1129.2116 1161.4012 1173.5042 1202.2073 1211.9779 1224.3675 1226.4757 1294.3999 1303.7272 1310.5736 1384.8213 1391.1674 1401.8794 1434.0131 1448.5126 1462.0535 1476.2630 1579.0297 1584.2556 1596.9058 1609.0444 3027.6004 3089.8033 3145.6675 3162.0461 3176.2007 3178.6163 3187.9779 3492.3317 3495.9625
redmass: 9.8028 14.2671 7.0127 10.8544 9.5599 11.4132 9.7897 12.6516 4.6273 5.1949 6.5938 6.2165 6.2530 6.2499 4.2615 12.7878 7.1476 5.6242 1.5044 2.2642 1.1112 3.9819 4.6444 5.5549 4.0445 4.4793 4.4823 6.5852 6.0963 8.8015 6.0183 3.3474 1.5828 5.6998 5.9541 3.9187 1.4056 4.5245 1.3753 1.5760 1.9308 1.3331 2.1653 1.9882 2.8873 2.6117 1.2293 1.1414 1.7027 1.9457 2.2876 2.2067 1.6739 1.4150 1.5176 5.0719 5.9371 4.2683 2.7265 2.5600 2.0000 1.6239 7.5541 6.6169 7.7345 7.1492 1.0591 1.1036 1.0869 1.0930 1.0932 1.0990 1.0938 1.0647 1.0648
irintensity: 0.0365 0.0683 0.4733 0.6886 0.0281 0.0981 0.4547 0.5020 0.4452 0.3647 2.6124 7.2292 1.4636 6.0912 2.9470 3.0149 6.0102 19.5097 72.2625 50.2917 132.6961 5.9234 1.8285 4.6050 2.2804 11.2133 13.0702 12.1703 11.5753 78.2000 6.1879 39.5306 41.4667 7.3854 21.4498 30.7117 30.5430 23.0795 10.1471 3.4947 27.6045 3.4556 15.7078 43.6039 23.7342 118.8660 35.0954 12.3372 1.7562 28.3044 16.6051 126.4119 22.5508 16.7266 11.9455 41.4436 4.3891 57.9883 61.8321 108.7537 48.6615 1.8510 29.8753 5.1979 16.8583 5.7193 13.8994 1.3652 3.5010 4.2261 0.9589 7.8628 1.2896 62.0184 60.8467
temp: 298.150 k
press: 1.00000 atm
elementType: 17 17 17 8 8 6 6 6 6 6 6 6 6 6 6 6 6 6 1 1 1 1 1 1 1 1 1
symmnumber: 1
zpe: 485115.7 jmol-1
zpe.correction: 0.184771 hartree
zpe.thermalcorrener: 0.201420 hartree
zpe.thermalcorrenthalpy: 0.202364 hartree
zpe.thermalcorrgfe: 0.138111 hartree
zpe.sumelectzpe: -2030.135728 hartree
zpe.sumelectthermal: -2030.119079 hartree
zpe.sumelectthermalent: -2030.118135 hartree
zpe.sumelectthermalfe: -2030.182388 hartree
dipole: 0.5105 -2.1257 0.0226
dipole: 2.1862
quadrupole: -123.0824 -118.5464 -125.6066
quadrupole: 3.8716 -0.7267 3.0791
quadrupole: -0.6707 3.8654 -3.1948 3.8716 -0.7267 3.0791
hfenergy: -2030.320499 hartree
pointgroup: C01 [X(C13H9Cl3O2)]
dipole: -0.4620258 0.7061694 0.1663445 debye
polarizability: 195.6133638|8.2975461|217.3924384|-4.4918751|12.9405608|105.409922 unknown
InChI: InChI=1S/C13H9Cl3O2/c14-9-5-8(13(18)11(16)6-9)4-7-2-1-3-10(15)12(7)17/h1-3,5-6,17-18H,4H2
charge 0 multiplicity 1
27 atoms
Cl 3.470578 3.090823 -0.705263
Cl 3.572959 -2.478124 -1.092599
Cl -3.902375 -2.748121 -0.941337
O  0.983783 2.55454 0.988863
O  -1.385437 -2.338429 0.734336
C  -0.219188 0.071104 1.692783
C  1.038217 0.1408 0.829654
C  -1.496615 0.075976 0.855753
C  1.604057 1.402008 0.495876
C  -2.044061 -1.151645 0.393119
C  1.650701 -1.035004 0.335485
C  -2.154914 1.279899 0.512047
C  2.765455 1.442799 -0.311486
C  2.801831 -0.948827 -0.469167
C  -3.227544 -1.130449 -0.382271
C  -3.333034 1.281856 -0.268814
C  3.385945 0.286134 -0.809997
C  -3.883236 0.061885 -0.724901
H  -0.236979 0.93711 2.375297
H  -0.183763 -0.849873 2.298792
H  1.207637 -2.004259 0.579029
H  -1.721306 2.222844 0.860487
H  -3.826693 2.224765 -0.523182
H  4.280486 0.346445 -1.43348
H  -4.79459 0.037714 -1.328744
H  1.493146 3.360711 0.707119
H  -1.884261 -3.118381 0.371003
