program: Gaussian 09
title: 000257456
version: EM64L-G09RevD.01
frameworkgroup: C1[X(C7H7ClO2)]
method: RPBEPBE
basis: SDD
operation: Freq
keyword: #p
keyword: freq=noraman
keyword: PBEPBE/SDD
title: #p freq=noraman PBEPBE/SDD
converged: YES YES NO NO
title: Mulliken charges:
elementType: Cl O O C C C C C C C H H H H H H H
charge: -0.024674 -0.440376 -0.406227 0.393786 -0.418657 -0.335627 -0.438430 -0.246392 -0.343391 0.370653 0.260548 0.267952 0.200389 0.234821 0.224791 0.338480 0.362353
chargesum: 0.00000
title: Mulliken charges with hydrogens summed into heavy atoms:
elementType: Cl O O C C C C C C C
charge: -0.024674 -0.101895 -0.043874 0.393786 -0.158109 -0.067675 -0.003220 -0.246392 -0.118599 0.370653
polarizability: 1.27350990e+02 2.09306511e+00 9.95252728e+01 -3.76783222e+00 1.23958676e+00 4.52017571e+01
1716.lowfreq: -11.6833 -5.3554 0.0023 0.0028 0.0030 2.1865 38.5504 110.9020 155.0384
frequency: 38.5106 110.8937 155.0378 193.0422 229.3490 280.6767 342.8047 354.3066 373.9620 397.9800 436.9184 480.0979 520.3172 596.0526 676.6928 711.3699 748.1028 803.8788 858.9916 875.1238 936.5370 954.5546 983.3604 1031.1723 1116.8770 1155.8809 1158.5480 1207.0852 1262.8903 1279.3967 1303.0766 1360.9439 1394.4171 1404.2466 1467.5255 1497.8197 1581.8148 1621.2574 2962.7547 3052.6896 3116.8227 3147.0564 3159.7742 3554.7127 3582.0056
redmass: 3.7039 4.8108 5.5829 4.9222 6.0766 3.1269 4.0532 1.1493 1.7646 3.7225 3.2063 4.7373 4.0591 4.7746 6.8262 3.9511 4.6995 1.4628 3.8166 1.6156 1.3438 2.3863 2.5981 3.0730 1.4818 1.1263 1.1527 2.2510 2.8215 1.5377 1.3061 1.3208 4.9808 2.8763 1.1059 2.8316 6.6924 6.9379 1.0672 1.0956 1.0894 1.0921 1.0949 1.0661 1.0661
irintensity: 5.4481 0.0436 2.2587 4.2250 5.5359 36.4291 24.9281 127.3419 115.4628 33.6223 8.1078 5.8596 29.5020 17.1623 17.2314 3.6545 21.4362 50.5035 42.4095 17.1798 5.1986 66.1256 8.6907 26.4963 160.6949 28.1685 29.1419 76.4851 64.7478 6.4422 4.6132 54.2515 9.5477 21.5713 10.4387 59.5561 9.4991 19.2449 59.2945 18.6990 14.1044 2.2598 3.6120 6.4929 46.6010
temp: 298.150 k
press: 1.00000 atm
elementType: 17 8 8 6 6 6 6 6 6 6 1 1 1 1 1 1 1
symmnumber: 1
zpe: 325846.8 jmol-1
zpe.correction: 0.124108 hartree
zpe.thermalcorrener: 0.133784 hartree
zpe.thermalcorrenthalpy: 0.134729 hartree
zpe.thermalcorrgfe: 0.088368 hartree
zpe.sumelectzpe: -880.692974 hartree
zpe.sumelectthermal: -880.683298 hartree
zpe.sumelectthermalent: -880.682354 hartree
zpe.sumelectthermalfe: -880.728714 hartree
dipole: 0.5827 1.9483 0.4676
dipole: 2.0867
quadrupole: -79.8458 -52.2052 -64.5345
quadrupole: -7.0881 1.5837 0.3377
quadrupole: -14.3173 13.3233 0.9940 -7.0881 1.5837 0.3377
hfenergy: -880.8170827 hartree
pointgroup: C01 [X(C7H7Cl1O2)]
dipole: 0.0875704 -0.7591162 -0.3000794 debye
dipolederiv: -0.4173909 0.3051518 0.0069943 0.3830346 -0.434137 -0.0156122 0.0071613 -0.016324 -0.0487263 -0.8626452 -0.0681069 0.2100447 -0.0823553 -0.4546109 -0.1527455 0.313733 -0.1565459 -0.3598842 -1.3003667 -0.434328 -0.1617099 -0.377943 -0.1472929 -0.0048047 -0.1753758 -0.0180638 -0.41867 -0.1035382 0.0197476 0.0731694 -0.0209279 -0.1398731 -0.0368453 0.0870093 -0.0029401 -0.1016515 -0.0826091 0.0359699 0.0122088 0.09174 -0.0593925 0.030242 0.0433476 0.0291737 -0.0971782 -0.0200713 0.0812705 0.0320952 -0.0634939 0.0861036 0.0182976 -0.0401824 0.0207211 -0.1449943 0.6665738 -0.0065679 -0.1369119 0.0528996 0.3746686 0.0984577 -0.2311496 0.0878051 0.4283543 0.4058705 -0.4934154 -0.0094914 -0.8112538 0.5644164 0.0054064 -0.0694964 0.0296236 -0.0804267 -0.2241483 -0.1860902 -0.03079 0.1730967 0.0597263 0.0596672 0.0247843 0.0211043 -0.1799736 1.0772111 0.5484871 0.1935366 0.479285 0.0110152 0.039591 0.1944509 0.0562383 0.1184316 0.0886692 -0.0478187 -0.0139087 -0.0378306 -0.0251481 -0.0305349 -0.0067311 -0.0299606 0.1492872 0.0432233 0.0838145 -0.008674 0.077734 0.0262529 -0.0100572 -0.0097108 -0.0128471 0.1553327 0.0117068 0.0380046 0.0405107 -0.0507966 -0.2111976 -0.0505805 0.0300851 -0.0087014 0.0491614 -0.0635352 -0.0046469 -0.0610555 0.0608854 0.0771019 0.0670309 -0.0343402 0.0186657 -0.0874807 0.0200035 -0.0799532 -0.0277752 -0.0671528 -0.081401 -0.0450289 -0.0200092 -0.0503174 0.1603425 0.3710658 0.0836309 -0.1355016 0.12256 0.2628379 0.0646888 -0.1270504 0.061382 0.0723813 0.3899809 0.1248503 0.0172585 0.0705187 0.0909304 -0.0371722 0.0134745 -0.0290135 0.3856946 unknown
polarizability: 125.0489191|-8.2181635|99.9517582|6.3445929|8.5888032|47.0773426 unknown
InChI: InChI=1S/C7H7ClO2/c8-6-3-5(4-9)1-2-7(6)10/h1-3,9-10H,4H2
charge 0 multiplicity 1
17 atoms
Cl -2.332375 2.032919 0.185426
O  3.6508 -0.318139 -0.315159
O  -2.829896 -0.872583 -0.306062
C  1.269194 0.04517 0.339095
C  0.273491 1.052604 0.361908
C  0.879246 -1.293797 0.084527
C  2.729532 0.391622 0.589879
C  -1.077489 0.723718 0.150427
C  -0.474119 -1.619052 -0.132246
C  -1.472384 -0.612007 -0.09949
H  0.543617 2.098019 0.546611
H  1.645352 -2.075288 0.055119
H  2.876515 1.490649 0.530851
H  3.053832 0.059524 1.591852
H  -0.76519 -2.659479 -0.327739
H  3.395727 -0.114516 -1.251097
H  -2.981452 -1.836863 -0.468505
