program: Gaussian 09
title: 000257455
version: EM64L-G09RevD.01
frameworkgroup: C1[X(C19H17Cl2NO2)]
method: RPBEPBE
basis: SDD
operation: Freq
keyword: #p
keyword: freq=noraman
keyword: PBEPBE/SDD
title: #p freq=noraman PBEPBE/SDD
converged: YES YES NO NO
title: Mulliken charges:
elementType: Cl Cl O O N C C C C C C C C C C C C C C C C C C C H H H H H H H H H H H H H H H H H
charge: -0.066082 -0.065227 -0.442082 -0.414993 -0.131411 -0.546915 0.232483 -0.441226 0.202173 0.428766 0.367259 0.118921 -0.633367 -0.375770 -0.457747 -0.420687 -0.445406 0.173186 -0.289905 -0.260820 -0.247991 -0.255070 -0.117075 -0.268812 0.218466 0.256029 0.257863 0.237399 0.243300 0.198557 0.221969 0.271408 0.239350 0.216352 0.239434 0.301660 0.228250 0.228261 0.279427 0.358626 0.361449
chargesum: 0.00000
title: Mulliken charges with hydrogens summed into heavy atoms:
elementType: Cl Cl O O N C C C C C C C C C C C C C C C C C C C
charge: -0.066082 -0.065227 -0.083457 -0.053544 -0.131411 -0.072421 0.232483 0.054036 0.202173 0.428766 0.367259 0.118921 0.030459 -0.104363 -0.218398 -0.204335 -0.205972 0.173186 0.011756 -0.032570 -0.019729 -0.255070 -0.117075 0.010615
polarizability: 2.40082716e+02 -1.24604017e+01 3.03085812e+02 1.29531834e+01 1.14057193e+01 1.78926984e+02
1716.lowfreq: -0.0012 -0.0004 0.0017 1.9958 2.9633 6.8101 13.3022 16.9169 24.1721
frequency: 12.9599 16.8518 24.0836 62.1979 72.1748 85.7341 97.6570 114.9563 134.4724 151.3499 178.4520 208.4214 216.8216 229.1096 238.1790 268.0973 291.8968 296.6666 309.2290 317.6010 337.3764 341.6348 354.9310 365.3037 385.9247 404.5283 428.3853 431.3739 451.2549 488.2496 500.7162 517.5586 530.9345 542.6293 551.7597 556.1351 599.1257 610.2521 661.6484 690.0989 703.2067 707.2777 723.5581 755.5199 783.2090 806.8440 810.8920 828.4648 846.2087 860.4733 876.3832 879.7250 903.4654 914.9562 940.2165 965.6447 973.9982 990.1376 1007.1043 1016.1546 1035.0718 1062.4743 1069.4259 1114.4601 1122.4880 1127.9923 1146.0619 1162.8889 1173.8740 1183.9982 1193.6087 1208.5519 1218.8206 1232.4544 1242.7014 1250.2206 1270.6158 1280.9421 1290.3705 1357.3224 1364.7744 1375.4804 1387.4451 1404.1167 1408.1407 1426.5743 1433.4465 1438.1283 1444.2799 1459.0509 1468.8683 1470.5735 1478.9240 1489.8564 1516.3994 1578.4775 1591.6421 1599.1929 1610.2761 1637.4843 2872.9622 2914.6684 2936.1056 3003.1825 3013.0311 3022.7632 3080.9114 3109.6163 3119.6813 3133.2636 3142.5047 3154.9474 3169.4431 3170.2806 3186.6400 3495.6367 3586.9544
redmass: 10.6844 7.5466 5.5810 4.8141 6.4263 4.0600 6.1179 6.4469 5.3652 5.8394 8.9009 4.3922 1.7530 2.7036 2.4534 3.8242 3.7481 4.0078 3.5178 1.1881 6.8873 3.2211 11.9639 3.2900 6.3564 3.0166 7.0316 3.0288 1.1077 4.1987 3.9237 4.9946 3.4580 4.1603 4.4680 4.3781 5.1047 4.6750 3.9464 8.0297 5.9444 5.7067 4.8786 1.3368 3.1946 1.5109 5.9547 4.3917 1.3760 4.7162 1.6753 4.5091 3.4753 1.4024 1.3367 1.4136 1.9854 1.3411 2.1902 2.2510 2.0913 3.0196 1.9215 1.4341 2.1465 2.3631 1.4423 1.1790 1.1376 1.6148 1.7665 1.6217 1.9047 1.7841 3.5379 1.8022 1.5242 1.8050 1.5106 1.5641 2.1073 1.6199 4.9444 3.0480 3.1169 3.5668 1.3033 2.7638 2.9785 1.2107 1.1667 2.0666 1.0990 1.0873 3.8835 7.6881 7.5303 7.8270 5.7291 6.7786 1.0552 1.0682 1.0644 1.0946 1.0891 1.0752 1.1004 1.0875 1.0868 1.0895 1.0965 1.0955 1.0939 1.0954 1.0937 1.0648 1.0661
irintensity: 0.0739 0.0076 0.0048 0.7107 0.7927 0.8927 0.3763 0.6738 0.3745 0.8439 0.0939 10.1274 1.4487 1.2943 1.5453 1.6313 8.7214 7.5261 14.1960 107.2331 2.5519 6.3373 3.6656 4.2213 7.4398 4.1355 2.3735 6.2901 126.7129 0.4810 3.6248 1.8837 0.7224 18.4300 9.8556 10.2280 9.0677 3.2422 3.3663 84.2028 11.0770 27.0836 4.9976 30.0410 8.1025 78.9069 15.1420 11.9964 23.6791 7.2140 1.2608 26.1596 13.0432 9.9343 0.2964 5.8398 32.2996 0.0665 62.5417 32.2494 5.9885 30.3724 24.0898 7.8588 80.7564 44.8806 53.2878 25.3923 1.3484 17.7984 18.0755 6.4159 101.6961 33.3499 120.3012 49.5381 0.9194 5.1861 11.6525 4.8955 17.8047 8.0283 65.2073 24.1304 10.4681 3.3582 11.6416 10.9683 105.1479 2.5712 8.2517 11.4513 3.5123 14.8551 40.2247 14.3092 10.7020 20.4318 6.5757 32.2928 128.9087 29.8052 66.9028 15.8116 11.1291 26.9157 35.1081 11.6098 2.6619 11.3470 23.4611 29.2765 15.6073 9.5354 0.6888 58.7685 43.2506
temp: 298.150 k
press: 1.00000 atm
elementType: 17 17 8 8 7 6 6 6 6 6 6 6 6 6 6 6 6 6 6 6 6 6 6 6 1 1 1 1 1 1 1 1 1 1 1 1 1 1 1 1 1
symmnumber: 1
zpe: 818307.0 jmol-1
zpe.correction: 0.311677 hartree
zpe.thermalcorrener: 0.333856 hartree
zpe.thermalcorrenthalpy: 0.334800 hartree
zpe.thermalcorrgfe: 0.258146 hartree
zpe.sumelectzpe: -1857.818859 hartree
zpe.sumelectthermal: -1857.796680 hartree
zpe.sumelectthermalent: -1857.795736 hartree
zpe.sumelectthermalfe: -1857.872390 hartree
dipole: -1.7756 -2.6350 -0.8810
dipole: 3.2973
quadrupole: -148.0417 -144.1574 -146.1350
quadrupole: 0.1638 8.1144 5.3110
quadrupole: -1.9304 1.9540 -0.0236 0.1638 8.1144 5.3110
hfenergy: -1858.1305353 hartree
pointgroup: C01 [X(C19H17Cl2N1O2)]
dipole: -0.5314952 1.1668579 0.1971354 debye
polarizability: 246.6437382|20.4484136|298.9879142|-10.4361288|0.824236|176.4638607 unknown
InChI: InChI=1S/C19H17Cl2NO2/c1-22(10-13-8-14(20)9-17(21)19(13)24)11-16-15-5-3-2-4-12(15)6-7-18(16)23/h2-9,23-24H,10-11H2,1H3
charge 0 multiplicity 1
41 atoms
Cl 5.814186 0.145187 1.53983
Cl 2.297104 -4.028444 0.348388
O  -1.677225 3.553999 -0.4006
O  3.583709 1.865579 0.347657
N  0.178471 0.482241 -1.752228
C  -1.118269 1.213085 -1.889128
C  -1.972375 1.171306 -0.631959
C  1.066821 1.064384 -0.720014
C  -2.554937 -0.061475 -0.156059
C  -3.413223 -0.05554 1.013882
C  2.073868 0.051857 -0.185022
C  -2.256049 2.354489 0.06931
C  0.858489 0.336478 -3.057652
C  -2.315879 -1.317812 -0.811462
C  -3.666148 1.18401 1.686014
C  -3.099404 2.369312 1.226285
C  -3.9963 -1.281935 1.473474
C  3.313516 0.493271 0.351621
C  1.776742 -1.329932 -0.175471
C  -2.901146 -2.496742 -0.34285
C  -3.749639 -2.484317 0.809076
C  4.217573 -0.466283 0.867381
C  2.702235 -2.248222 0.349208
C  3.941366 -1.842998 0.881494
H  -1.666999 0.723836 -2.717983
H  -0.958615 2.27373 -2.183652
H  0.432914 1.408563 0.119608
H  1.612016 1.964659 -1.085959
H  1.776924 -0.262973 -2.933936
H  1.143247 1.31688 -3.513997
H  0.196989 -0.193126 -3.7671
H  -1.640729 -1.341806 -1.671289
H  -4.313963 1.189782 2.57011
H  -3.295445 3.317229 1.744894
H  -4.642464 -1.2590 2.359411
H  0.816323 -1.64618 -0.59191
H  -2.703475 -3.444648 -0.855869
H  -4.197227 -3.417998 1.166481
H  4.657279 -2.561275 1.286863
H  -1.944368 4.316125 0.169876
H  4.487013 2.034208 0.727876
