program: Gaussian 09
title: 000257453
version: EM64L-G09RevD.01
frameworkgroup: C1[X(C15H16O2)]
method: RPBEPBE
basis: SDD
operation: Freq
keyword: #pfreq=noraman
keyword: PBEPBE/SDD
title: #p freq=noraman PBEPBE/SDD
converged: YES YES NO NO
title: Mulliken charges:
elementType: O O C C C C C C C C C C C C C C C H H H H H H H H H H H H H H H H
charge: -0.449014 -0.449000 -0.680626 0.363412 0.363624 -0.026910 -0.026836 0.331363 0.331348 -0.365710 -0.365791 -0.413242 -0.413209 -0.250520 -0.250612 -0.870548 -0.870602 0.234177 0.234156 0.260765 0.260699 0.227487 0.227472 0.220491 0.220514 0.227962 0.235034 0.248544 0.228194 0.234803 0.248553 0.366999 0.367020
chargesum: 0.00000
title: Mulliken charges with hydrogens summed into heavy atoms:
elementType: O O C C C C C C C C C C C C C C C
charge: -0.082015 -0.081980 -0.212293 0.363412 0.363624 -0.026910 -0.026836 0.331363 0.331348 -0.104945 -0.105092 -0.185756 -0.185737 -0.030029 -0.030098 -0.159008 -0.159051
polarizability: 2.01534379e+02 -9.37939494e+00 1.80695688e+02 6.78030855e-03 -3.49521107e-03 1.11182106e+02
1716.lowfreq: -7.8501 -0.0004 0.0004 0.0008 4.3383 7.8971 21.3372 45.0593 45.1451
frequency: 21.3215 45.0514 45.1399 108.9053 138.2031 155.9045 156.4078 174.8708 209.8246 224.6239 273.5133 281.5918 288.5575 294.2169 296.2950 308.9979 354.6543 455.2376 468.2564 469.9547 494.6484 512.0051 527.4700 537.0610 538.6310 550.6334 597.9923 664.2369 667.2436 728.0798 757.9746 778.6012 793.5027 812.6342 817.6032 894.3039 899.3048 909.4010 919.3691 942.0762 970.7319 972.8693 994.2704 1011.2654 1040.9329 1041.0564 1077.9876 1087.0077 1150.4576 1160.2311 1165.6306 1175.0977 1177.3150 1208.4289 1211.1244 1268.2034 1268.9881 1294.0516 1301.2194 1308.4996 1388.3069 1389.6077 1398.4928 1398.7692 1443.2243 1444.7913 1459.9547 1461.9600 1470.0360 1478.4825 1478.5940 1488.2829 1491.8740 1599.2482 1602.7748 1619.9624 1623.7554 2948.4169 2948.4908 3015.5074 3015.5358 3023.9728 3083.9966 3084.4715 3084.5364 3121.4738 3121.4948 3140.6338 3140.7035 3161.1640 3161.1992 3581.4358 3581.5553
redmass: 4.2746 4.6507 4.2732 4.1648 3.9302 1.0728 1.0826 4.7733 2.5626 2.7354 4.9269 1.2440 1.3317 2.4678 3.2419 3.8534 2.6191 3.8809 2.6135 5.0288 5.5524 3.9226 4.4737 3.6908 3.9478 4.9945 5.3954 4.7202 4.7502 4.6379 1.9095 1.2510 2.5215 5.0077 3.7357 2.3618 2.1529 1.3309 1.5635 1.9506 1.3234 1.3455 1.7413 1.7998 1.5035 1.5036 1.9449 1.8549 1.2228 1.4799 2.1605 1.6429 1.2144 2.1947 2.2460 2.2405 1.9347 1.7844 1.4945 1.4533 3.3138 3.4747 1.4352 1.5000 2.3523 1.8995 2.4214 2.2170 1.1776 1.0487 1.0470 1.3536 1.3993 6.0573 6.0907 7.1645 6.7763 1.0403 1.0404 1.0977 1.0977 1.0588 1.1021 1.0941 1.0953 1.0870 1.0870 1.0912 1.0912 1.0989 1.0989 1.0654 1.0654
irintensity: 0.5095 0.7570 0.5819 1.0312 0.0376 0.0267 0.0211 2.3080 5.6984 15.6262 0.6951 64.0730 127.2371 6.2624 27.5763 0.0472 11.7499 1.5130 7.3521 3.8980 0.9713 0.3602 3.0355 0.7807 3.3173 7.2607 2.2518 5.4912 0.0393 6.1923 58.7346 40.6581 38.0551 16.1214 0.2569 2.4528 7.9836 1.2702 0.0388 42.9692 2.7487 1.2689 1.2750 17.6661 4.0580 8.0089 2.3046 68.7683 36.1904 153.7029 19.3131 54.5175 1.8134 21.5231 0.0030 1.4021 18.9576 16.3877 6.0775 4.6882 4.6114 1.4447 0.0146 50.2526 56.8554 7.9729 19.9067 4.6695 12.7738 4.4022 19.6968 51.1235 3.6362 9.9210 2.6695 2.1907 0.0112 77.4946 5.1714 13.0639 35.5118 20.5138 2.3092 7.4694 22.5734 9.3269 7.7528 16.5908 17.3446 30.4605 9.2924 23.4758 26.9905
temp: 298.150 k
press: 1.00000 atm
elementType: 8 8 6 6 6 6 6 6 6 6 6 6 6 6 6 6 6 1 1 1 1 1 1 1 1 1 1 1 1 1 1 1 1
symmnumber: 1
zpe: 702521.2 jmol-1
zpe.correction: 0.267576 hartree
zpe.thermalcorrener: 0.283982 hartree
zpe.thermalcorrenthalpy: 0.284926 hartree
zpe.thermalcorrgfe: 0.223298 hartree
zpe.sumelectzpe: -730.421444 hartree
zpe.sumelectthermal: -730.405038 hartree
zpe.sumelectthermalent: -730.404094 hartree
zpe.sumelectthermalfe: -730.465722 hartree
dipole: 0.0025 0.0012 -1.4472
dipole: 1.4472
quadrupole: -79.1027 -90.2149 -103.7023
quadrupole: -12.3179 0.0110 -0.0110
quadrupole: 11.9039 0.7918 -12.6957 -12.3179 0.0110 -0.0110
hfenergy: -730.6890204 hartree
pointgroup: C01 [X(C15H16O2)]
dipole: 0.0012069 -0.0010812 0.5693534 debye
polarizability: 200.2385424|10.6441456|181.991431|-0.0231282|0.0753169|111.1821989 unknown
InChI: InChI=1S/C15H16O2/c1-10-5-3-7-12(14(10)16)9-13-8-4-6-11(2)15(13)17/h3-8,16-17H,9H2,1-2H3
charge 0 multiplicity 1
33 atoms
O  1.945561 1.922059 -0.771119
O  -1.945649 -1.919952 -0.775347
C  -0.000206 0.002592 -1.535285
C  1.214248 -0.375555 -0.688754
C  -1.214391 0.377317 -0.686973
C  2.172738 0.600546 -0.313483
C  -2.172248 -0.599913 -0.313255
C  3.309256 0.285726 0.482319
C  -3.308272 -0.287256 0.484002
C  1.412639 -1.703474 -0.240807
C  -1.412959 1.704188 -0.235884
C  3.469644 -1.054388 0.907416
C  -3.46868 1.051768 0.912553
C  2.52969 -2.047365 0.551945
C  -2.529368 2.045946 0.558724
C  4.309411 1.365195 0.861124
C  -4.308254 -1.367756 0.860398
H  0.261083 0.860124 -2.178458
H  -0.261383 -0.851998 -2.182512
H  0.668573 -2.458189 -0.517273
H  -0.669289 2.459815 -0.51101
H  4.339312 -1.315704 1.522454
H  -4.337978 1.311217 1.528907
H  2.668659 -3.080089 0.889245
H  -2.668376 3.077831 0.898519
H  4.784854 1.832689 -0.026233
H  3.846118 2.17364 1.462923
H  5.125149 0.940931 1.46951
H  -4.785287 -1.831528 -0.02803
H  -3.844467 -2.17879 1.458356
H  -5.122729 -0.94545 1.471824
H  2.694566 2.512195 -0.508668
H  -2.692866 -2.51167 -0.511329
