program: Gaussian 09
title: 000257449
version: EM64L-G09RevD.01
frameworkgroup: C1[X(C11H15NO4)]
method: RPBEPBE
basis: SDD
operation: Freq
keyword: #p
keyword: freq=noraman
keyword: PBEPBE/SDD
title: #p freq=noraman PBEPBE/SDD
converged: YES YES NO NO
title: Mulliken charges:
elementType: O O O O N C C C C C C C C C C C H H H H H H H H H H H H H H H
charge: -0.247604 -0.443177 -0.487384 -0.484888 -0.113650 -0.344017 -0.340120 -0.463484 -0.322555 -0.319116 0.369608 -0.022832 -0.353722 0.015399 -0.372741 0.187023 0.228440 0.199441 0.191114 0.209959 0.221226 0.235044 0.213943 0.189097 0.189757 0.212241 0.272466 0.221847 0.387892 0.397656 0.373134
chargesum: 0.00000
title: Mulliken charges with hydrogens summed into heavy atoms:
elementType: O O O O N C C C C C C C C C C C
charge: -0.247604 -0.055285 -0.089727 -0.111754 -0.113650 0.083864 0.060952 -0.007214 0.080485 0.082882 0.369608 -0.022832 -0.081255 0.015399 -0.150893 0.187023
polarizability: 1.81272317e+02 7.17168195e+00 1.40223406e+02 -1.31188092e+01 5.57451475e+00 9.42676408e+01
1716.lowfreq: -1.8167 0.0003 0.0005 0.0007 9.1282 12.1762 29.6518 56.8607 58.5100
frequency: 29.5154 56.7973 58.3733 137.2969 154.6654 161.9410 213.6940 243.3256 245.9988 260.3137 281.5708 285.2241 301.2160 319.5999 335.6237 401.0297 416.9784 449.2700 465.9847 482.4255 489.7737 509.9933 537.6837 579.1701 585.6086 615.4327 682.7248 718.5359 743.0658 767.8488 778.4305 806.5792 843.3839 894.8171 910.1349 935.7907 971.4697 994.8693 1010.2881 1029.7830 1054.0551 1083.8029 1106.0130 1116.2087 1131.0310 1143.6238 1148.1568 1193.4495 1211.0048 1214.8280 1223.3667 1227.0680 1262.3102 1269.6450 1281.3194 1294.7224 1310.2562 1335.5719 1348.2163 1363.2863 1371.3015 1388.4604 1424.7841 1442.7358 1450.0912 1451.7778 1462.1837 1474.0839 1491.7413 1496.9687 1622.5682 1640.9825 2865.0293 2874.4450 2901.2407 2950.8331 2954.7939 2987.7044 3021.9763 3039.6241 3079.0359 3082.7773 3126.2227 3157.6912 3522.2366 3569.1302 3626.3216
redmass: 4.8146 5.0803 3.5918 4.8682 6.1521 5.3855 4.3885 1.2492 1.9641 4.9672 3.0096 3.3411 3.8369 2.6383 4.5359 1.8995 1.1150 6.1475 3.0197 5.3236 1.1514 6.4625 3.9716 4.0506 3.0525 2.6154 6.8018 5.5085 5.6066 2.0001 2.1942 3.7674 1.6009 2.3517 3.8409 1.3186 2.9162 2.1249 2.5001 2.1434 1.9923 3.6901 2.1630 1.4414 2.2095 1.3677 2.7032 1.0695 2.1831 1.5188 1.3989 1.9921 1.6835 1.4742 1.5840 1.3064 1.8247 1.2594 1.3263 1.4304 1.2633 1.5319 4.7664 1.0835 1.0897 1.0930 1.1044 1.1370 4.0543 3.1140 7.6505 7.2332 1.0701 1.0695 1.0676 1.0667 1.0667 1.0901 1.0897 1.0895 1.0961 1.0974 1.0888 1.0945 1.0650 1.0654 1.0666
irintensity: 0.3506 0.7711 0.3337 2.9507 3.9302 5.2860 1.0918 169.4819 4.0470 2.6980 4.8753 6.9872 13.4067 6.6136 5.0328 0.1953 189.2020 13.3412 2.8898 3.0859 100.6101 4.2569 4.1810 5.4350 5.0639 6.9746 20.9954 1.7838 1.3234 20.1869 31.4242 30.0899 0.4668 34.7558 108.1521 12.1422 121.4438 21.4557 64.1679 13.2177 24.4290 48.9660 2.3754 33.5958 26.8165 18.5042 2.9402 1.9977 86.6450 23.6426 131.0441 42.1953 213.0418 30.2936 36.7043 1.1954 130.5538 6.4833 7.2965 2.5742 1.7055 1.5823 0.9356 2.2409 8.0401 12.1649 10.1868 18.2604 56.6500 56.2913 2.1241 51.2421 57.6688 95.2304 57.8729 30.4880 106.2418 19.5364 50.2659 27.9954 44.1102 38.0939 10.1229 6.2018 70.2321 93.6035 59.1727
temp: 298.150 k
press: 1.00000 atm
elementType: 8 8 8 8 7 6 6 6 6 6 6 6 6 6 6 6 1 1 1 1 1 1 1 1 1 1 1 1 1 1 1
symmnumber: 1
zpe: 654960.9 jmol-1
zpe.correction: 0.249461 hartree
zpe.thermalcorrener: 0.264643 hartree
zpe.thermalcorrenthalpy: 0.265587 hartree
zpe.thermalcorrgfe: 0.207152 hartree
zpe.sumelectzpe: -782.553841 hartree
zpe.sumelectthermal: -782.538660 hartree
zpe.sumelectthermalent: -782.537716 hartree
zpe.sumelectthermalfe: -782.596150 hartree
dipole: -2.9465 -2.1193 -0.8412
dipole: 3.7257
quadrupole: -94.5975 -85.8073 -94.2814
quadrupole: 10.0639 -6.6127 0.6492
quadrupole: -3.0354 5.7548 -2.7193 10.0639 -6.6127 0.6492
hfenergy: -782.8033027 hartree
pointgroup: C01 [X(C11H15N1O4)]
dipole: -1.1737159 -0.8167521 -0.3223565 debye
polarizability: 181.7215423|6.0338025|140.16955|-12.5298408|4.941405|93.8722714 unknown
InChI: InChI=1S/C11H15NO4/c13-9-2-1-8(10(14)11(9)15)7-12-3-5-16-6-4-12/h1-2,13-15H,3-7H2
charge 0 multiplicity 1
31 atoms
O  4.567822 -0.58764 0.715514
O  -1.616019 2.415183 0.247087
O  -4.028471 1.157742 0.51105
O  -4.33391 -1.526991 0.020504
N  1.972559 0.184606 -0.33976
C  2.151245 -0.154286 1.096379
C  3.226873 0.75508 -0.891258
C  0.799118 1.060604 -0.575016
C  3.315646 -1.142701 1.260134
C  4.379222 -0.245752 -0.704808
C  -0.525437 0.327153 -0.405789
C  -1.685764 1.038725 -0.014575
C  -0.652087 -1.058506 -0.667416
C  -2.926077 0.375561 0.113583
C  -1.888189 -1.734403 -0.543615
C  -3.028526 -1.003724 -0.150508
H  1.21855 -0.609975 1.476365
H  2.358589 0.762236 1.704283
H  3.49745 1.719259 -0.390996
H  3.08736 0.958168 -1.970604
H  0.872989 1.439044 -1.614939
H  0.803101 1.961748 0.083143
H  3.522501 -1.343922 2.324267
H  3.072404 -2.09452 0.739522
H  4.163737 -1.168577 -1.286135
H  5.33945 0.185511 -1.033401
H  0.252805 -1.597938 -0.964499
H  -1.957532 -2.808926 -0.751353
H  -2.516789 2.732746 0.521826
H  -4.834978 0.584609 0.566943
H  -4.366343 -2.492811 -0.177627
