program: Gaussian 09
title: 000257425
version: EM64L-G09RevD.01
frameworkgroup: C1[X(C9H12N2)]
method: RPBEPBE
basis: SDD
operation: Freq
keyword: #pfreq=noraman
keyword: PBEPBE/SDD
title: #p freq=noraman PBEPBE/SDD
converged: NO YES NO NO
title: Mulliken charges:
elementType: N N C C C C C C C C C H H H H H H H H H H H H
charge: -0.367961 -0.363556 0.236191 -0.582875 -0.732131 0.495988 -0.392105 -0.438256 -0.226555 -0.222722 -0.244295 0.212916 0.216250 0.271329 0.267441 0.231411 0.223484 0.238625 0.270326 0.228924 0.225152 0.224543 0.227876
chargesum: 0.00000
title: Mulliken charges with hydrogens summed into heavy atoms:
elementType: N N C C C C C C C C C
charge: -0.096632 -0.096115 0.236191 -0.153710 -0.038611 0.495988 -0.121779 -0.209332 -0.001402 0.001820 -0.016419
polarizability: 1.35102301e+02 -2.75817566e+00 1.06894830e+02 1.35860226e+01 5.41849374e+00 7.32924160e+01
1716.lowfreq: -0.0008 -0.0007 0.0004 1.7721 7.2573 10.2538 38.7943 64.7772 93.2333
frequency: 38.6680 64.5391 93.2137 190.9372 230.3930 280.6082 315.3413 364.8606 378.8092 405.7858 434.3196 489.0764 584.1236 616.6629 649.2862 707.7652 746.8168 755.6873 814.6034 822.3769 859.4352 910.7754 928.9641 979.9745 981.7331 989.4541 995.7203 1000.5154 1026.6824 1042.6151 1080.5585 1106.2796 1131.5559 1170.1129 1173.6860 1187.3855 1209.2395 1258.7632 1296.2643 1329.2212 1347.9054 1359.3783 1380.9207 1397.4597 1440.0831 1451.2198 1461.9206 1472.6096 1482.4559 1591.3679 1612.6953 2983.7391 2986.6932 3045.3680 3078.9235 3096.9224 3112.2629 3121.8189 3133.8852 3144.6175 3160.6387 3269.9921 3285.9778
redmass: 3.6022 3.6792 4.1807 1.0809 3.6185 4.5899 3.6099 2.0533 2.5468 2.8463 2.6581 3.3556 5.3843 6.2370 5.6271 1.9158 1.9665 5.0390 3.1412 4.0796 1.2462 1.6257 1.5007 1.5149 1.4766 5.7775 1.3465 1.4164 2.2013 1.4414 1.5646 1.2279 1.2127 1.1832 1.2077 1.1197 2.5064 1.5616 1.4583 1.3324 1.9387 1.6991 5.6043 1.4922 1.9699 1.1524 1.0675 1.0660 2.2560 6.0398 6.0528 1.0465 1.0483 1.1024 1.0983 1.1007 1.0871 1.0863 1.0916 1.0962 1.1015 1.0775 1.0759
irintensity: 0.2119 1.1288 0.2427 0.0713 1.8552 0.7936 1.4141 2.3250 3.2054 0.0886 0.5035 15.9335 2.9540 0.4981 5.7794 48.8080 46.2337 16.4884 12.8813 1.8308 0.2751 1.7232 4.0187 6.9984 0.6359 0.2370 6.4100 2.3924 8.3067 23.7628 29.0323 91.2636 60.0957 1.8445 3.4435 0.2492 0.8228 21.2380 4.2582 0.7195 17.4652 4.7493 0.8315 27.0343 7.7956 6.2192 12.3647 11.8701 17.9181 1.0907 7.8241 28.4951 13.9406 13.5351 19.1529 21.9187 9.0095 0.1127 16.0237 32.5736 24.3782 4.7949 15.8677
temp: 298.150 k
press: 1.00000 atm
elementType: 7 7 6 6 6 6 6 6 6 6 6 1 1 1 1 1 1 1 1 1 1 1 1
symmnumber: 1
zpe: 502800.4 jmol-1
zpe.correction: 0.191507 hartree
zpe.thermalcorrener: 0.201741 hartree
zpe.thermalcorrenthalpy: 0.202685 hartree
zpe.thermalcorrgfe: 0.155161 hartree
zpe.sumelectzpe: -458.771838 hartree
zpe.sumelectthermal: -458.761603 hartree
zpe.sumelectthermalent: -458.760659 hartree
zpe.sumelectthermalfe: -458.808183 hartree
dipole: 1.1087 -1.0141 0.3445
dipole: 1.5415
quadrupole: -69.8718 -62.8185 -64.6751
quadrupole: 0.6428 2.3993 3.0024
quadrupole: -4.0834 2.9700 1.1134 0.6428 2.3993 3.0024
hfenergy: -458.9633446 hartree
pointgroup: C01 [X(C9H12N2)]
dipole: -0.4192713 -0.437636 -0.0221239 debye
dipolederiv: -0.168066 0.0290193 -0.0589577 -0.0903296 -0.4829768 0.1430738 -0.0268834 0.0901147 -0.1286734 -0.6385039 -0.0914448 -0.1626973 0.0701006 -0.1287345 0.0568835 -0.063589 0.0150602 -0.1147179 0.4437468 0.0229764 -0.03382 0.0148243 0.325985 0.0585771 -0.1996161 0.073125 0.3190868 -0.1081285 -0.0311021 0.0361835 -0.0414634 0.1160188 -0.069531 0.072643 -0.0610291 0.0519724 -0.0185191 0.0136108 0.0362775 -0.0350795 -0.0645094 -0.1011493 0.0764506 -0.0732605 -0.0671196 0.2990018 -0.0039682 0.0696926 -0.0089857 -0.0345268 0.0090836 0.181082 0.0226361 -0.0514866 -0.1298424 0.0779015 -0.0007993 0.1305572 -0.0331159 -0.0274679 -0.0398983 -0.0415664 -0.1334651 -0.1694689 -0.0265308 0.0385635 -0.0255041 0.029689 -0.0994578 0.0189646 -0.090179 -0.1070029 -0.0253953 -0.023355 0.0510417 -0.0445394 0.0787994 -0.1031297 0.0671157 -0.1082093 -0.0867666 0.0173181 0.0908587 0.0221626 0.1017551 0.0428579 -0.0476872 0.0066652 -0.055539 -0.11584 0.040956 0.0014769 0.0878648 -0.0051834 -0.0949756 -0.0334365 0.0747035 -0.0322236 -0.1286859 -0.0312163 -0.0261815 -0.0663157 -0.0380809 -0.0231327 -0.1235128 -0.0521402 -0.0675533 -0.0012013 0.0195071 -0.0059082 0.0005158 0.0516003 -0.0797941 0.1303279 -0.0015899 0.075156 0.020405 0.1031699 0.0270778 0.0881512 0.072419 0.2100243 -0.0819798 0.1211876 -0.0262156 -0.0363731 0.2659873 0.055592 0.0917377 0.0193004 0.1044879 -0.1102781 0.0279306 -0.1039331 -0.0504692 -0.0519166 0.0100404 0.1229616 -0.0380634 0.0874051 0.0238425 0.1126017 -0.0155986 0.0121695 0.1126615 -0.0284272 0.0020246 -0.0306352 -0.1123401 0.0481104 -0.0275637 0.0981423 0.0335509 -0.0409859 0.0003824 -0.1120608 0.0111524 0.0576011 0.0248252 -0.1258808 -0.0110068 0.0357592 0.076198 -0.1011291 -0.0065457 -0.0994812 0.0296911 0.0294837 -0.0077889 0.0314684 0.1210007 0.0684418 0.0703575 -0.0663997 0.0466884 -0.0407907 0.0953539 -0.0532225 0.1009772 0.0833316 0.0580148 0.0427385 -0.0458995 0.0590177 -0.0554687 0.1054266 -0.058849 0.1051045 0.0910575 -0.0138037 -0.1105217 -0.0026537 -0.1256785 -0.0304079 0.0426107 -0.0055987 0.043725 0.136343 -0.1091565 0.0065361 -0.0910279 0.0056089 0.0982135 0.0300313 -0.096724 0.0308049 0.1171251 unknown
polarizability: 134.5240288|7.6679009|102.1110155|12.8969347|-12.9199475|78.6545033 unknown
InChI: InChI=1S/C9H12N2/c1-9(10-11-9)7-8-5-3-2-4-6-8/h2-6,10-11H,7H2,1H3
charge 0 multiplicity 1
23 atoms
N  2.39895 1.230925 -0.413996
N  3.406391 0.261834 0.329557
C  2.005566 -0.166878 -0.014248
C  0.947038 -0.204302 1.098074
C  1.930528 -1.258263 -1.070363
C  -0.480841 -0.107573 0.568806
C  -0.913068 1.070463 -0.09822
C  -1.396197 -1.178971 0.72029
C  -2.229789 1.170518 -0.598876
C  -2.715582 -1.081776 0.218687
C  -3.136563 0.094268 -0.443234
H  1.152604 0.646043 1.777127
H  1.075282 -1.138991 1.677232
H  2.741123 1.227731 -1.400545
H  3.431294 0.63727 1.304843
H  2.811653 -1.204814 -1.732911
H  1.920831 -2.256966 -0.596239
H  1.01058 -1.157695 -1.672997
H  -0.207072 1.900958 -0.216154
H  -1.075435 -2.093498 1.235796
H  -2.551629 2.086711 -1.107648
H  -3.411841 -1.91878 0.346115
H  -4.159123 0.173288 -0.829896
