program: Gaussian 09
title: 000257389
version: EM64L-G09RevD.01
frameworkgroup: C1[X(C12H21N3O3)]
method: RPBEPBE
basis: SDD
operation: Freq
keyword: #p
keyword: freq=noraman
keyword: PBEPBE/SDD
title: #p freq=noraman PBEPBE/SDD
converged: YES YES NO NO
title: Mulliken charges:
elementType: O O O N N N C C C C C C C C C C C C H H H H H H H H H H H H H H H H H H H H H
charge: -0.212093 -0.218425 -0.220137 -0.370477 -0.376482 -0.282673 0.113508 -0.465007 -0.447124 -0.358202 0.138861 0.152483 -0.402625 -0.358479 0.152410 -0.699486 -0.327397 -0.688720 0.238190 0.225586 0.239196 0.240094 0.201938 0.207241 0.205093 0.251732 0.199206 0.199996 0.366486 0.365962 0.240757 0.212611 0.212133 0.218544 0.215532 0.180647 0.202608 0.232414 0.214100
chargesum: 0.00000
title: Mulliken charges with hydrogens summed into heavy atoms:
elementType: O O O N N N C C C C C C C C C C C C
charge: -0.212093 -0.218425 -0.220137 -0.003991 -0.010520 -0.041916 0.113508 -0.001232 0.032167 0.050977 0.138861 0.152483 0.054199 0.040723 0.152410 -0.056198 0.068781 -0.039597
polarizability: 1.71032321e+02 1.24749189e+01 1.71050890e+02 4.73972035e+00 -2.89260079e+00 1.42940849e+02
1716.lowfreq: -6.9527 -6.8533 -0.0009 -0.0008 -0.0006 7.8445 19.3440 34.5250 41.2618
frequency: 19.2786 34.5087 41.1896 53.4450 58.5228 69.8904 87.0605 127.1572 128.3574 137.6718 140.3673 158.1242 174.5465 195.1042 225.4789 228.3475 236.4956 250.0826 288.8297 337.7004 358.0694 372.8037 393.2098 445.0424 463.8882 481.4553 509.0976 597.0166 628.1518 656.3862 677.4033 686.7886 727.9065 730.5351 752.4925 758.9219 774.6537 790.3732 790.9511 810.6554 884.5001 894.5977 905.3594 962.8036 969.1501 993.8533 1009.9174 1035.7118 1040.4614 1066.0840 1079.9245 1104.2449 1113.0637 1118.3379 1139.1992 1149.8915 1166.6757 1204.5862 1221.1673 1240.7217 1261.6586 1265.9183 1288.3632 1292.7847 1296.1054 1305.7143 1313.1364 1334.5027 1344.5516 1356.9374 1365.9087 1375.4762 1375.8369 1387.7099 1393.2417 1396.4033 1447.2838 1450.6323 1463.2706 1464.4910 1472.7750 1474.4868 1479.3744 1480.6757 1486.4719 1491.0176 1501.0561 1612.7193 1648.7435 1677.6524 2861.4546 2887.5982 2962.6743 2971.6953 2974.2718 2979.2060 2982.6045 3004.2207 3004.9147 3010.1592 3031.5056 3032.8060 3054.2574 3069.9887 3071.6184 3074.6984 3079.6637 3093.4686 3416.4626 3518.2038 3519.9410
redmass: 7.7886 3.5898 2.7029 2.6287 1.7271 2.4555 3.8852 3.0358 3.0419 2.3668 4.6572 7.9309 3.9171 4.3183 3.0354 1.8900 1.4759 1.1589 2.5739 3.6362 10.7432 10.5905 3.5033 3.3788 4.6947 8.9634 4.0858 8.1274 3.9389 2.2709 1.5827 2.2856 2.6572 1.3772 3.4997 1.7991 1.4068 1.5340 1.3726 1.1105 1.7258 1.7934 1.7160 1.5413 3.8777 3.3710 3.1855 3.2315 1.9672 2.8271 2.3207 2.1521 2.3374 2.1545 2.1068 3.1351 2.8515 2.5703 1.4586 1.5062 1.2173 1.3220 1.2156 1.1863 1.5774 1.5030 1.3737 1.4644 1.3676 1.5443 8.4622 1.5255 2.0370 1.2582 1.2152 1.3695 1.0953 1.1586 1.0792 1.0758 1.0624 1.0692 1.0419 1.0527 1.0759 1.0874 1.0840 6.8161 8.4606 5.5387 1.0719 1.0707 1.0580 1.0595 1.0362 1.0375 1.0585 1.0868 1.0983 1.0602 1.1027 1.0909 1.1011 1.1010 1.0979 1.0992 1.1034 1.1002 1.0740 1.0757 1.0781
irintensity: 0.7672 0.0119 0.4238 0.3231 0.0419 1.0008 0.4278 3.4165 0.3780 0.6751 1.3467 13.9197 0.4631 0.1788 1.8430 1.6270 0.4763 1.0570 2.1605 4.7740 23.7059 8.0553 5.8467 0.8382 15.2955 17.5738 8.5308 0.5566 7.2036 3.9272 92.8519 21.3939 14.4625 8.0385 2.0512 3.0615 2.5360 170.7253 50.2998 7.7428 1.1517 4.2748 1.6823 3.2836 12.6307 4.3805 1.0757 7.3128 4.4435 0.6697 5.1646 43.1250 16.2585 2.8297 21.2723 61.0242 13.2998 26.9465 2.7016 21.1846 2.9651 34.6643 1.7080 24.8257 139.7057 99.9099 25.7535 37.9198 41.0169 8.2816 207.6126 7.0979 6.3705 11.4153 10.4187 11.2309 27.9477 8.1241 5.2958 1.7824 16.2826 5.1535 12.7730 7.2592 13.5481 0.7504 7.5358 295.6403 86.1512 617.5570 103.2290 104.5913 1.1030 52.8741 38.9703 31.0234 13.7072 24.2780 1.0136 23.6275 16.8871 7.3350 26.5128 48.1331 55.0153 49.9166 33.3564 36.9675 1.9050 84.3110 44.1498
temp: 298.150 k
press: 1.00000 atm
elementType: 8 8 8 7 7 7 6 6 6 6 6 6 6 6 6 6 6 6 1 1 1 1 1 1 1 1 1 1 1 1 1 1 1 1 1 1 1 1 1
symmnumber: 1
zpe: 860142.1 jmol-1
zpe.correction: 0.327611 hartree
zpe.thermalcorrener: 0.347812 hartree
zpe.thermalcorrenthalpy: 0.348757 hartree
zpe.thermalcorrgfe: 0.276589 hartree
zpe.sumelectzpe: -858.429004 hartree
zpe.sumelectthermal: -858.408803 hartree
zpe.sumelectthermalent: -858.407859 hartree
zpe.sumelectthermalfe: -858.480026 hartree
dipole: -1.1364 -1.8698 0.3550
dipole: 2.2167
quadrupole: -105.6102 -117.3657 -116.2024
quadrupole: 0.1330 -2.5713 -0.0265
quadrupole: 7.4493 -4.3063 -3.1429 0.1330 -2.5713 -0.0265
hfenergy: -858.7566152 hartree
pointgroup: C01 [X(C12H21N3O3)]
dipole: -0.4603405 -0.7256093 0.1487682 debye
polarizability: 171.8602299|12.3530084|170.4939798|3.9301537|-3.2055931|142.6698498 unknown
InChI: InChI=1S/C12H21N3O3/c1-3-5-6-12(7-8-13-4-2)9(16)14-11(18)15-10(12)17/h13-15H,3-8H2,1-2H3
charge 0 multiplicity 1
39 atoms
O  1.313825 0.345036 2.439291
O  -0.062703 -0.091189 -2.191993
O  1.724065 3.870179 -0.55927
N  1.464594 2.082661 0.926033
N  0.755696 1.880917 -1.317347
N  -3.63261 -0.410891 0.478774
C  0.257276 -0.022365 0.248833
C  0.749274 -1.501557 0.242836
C  -1.242429 0.087899 0.753829
C  2.237132 -1.670647 -0.136385
C  1.064944 0.781324 1.286078
C  0.313553 0.549936 -1.176207
C  -2.282965 -0.742868 -0.026826
C  2.668784 -3.155209 -0.146409
C  1.335876 2.698167 -0.331488
C  4.151764 -3.342568 -0.531129
C  -4.747908 -0.992892 -0.303452
C  -6.105341 -0.595872 0.30073
H  0.127625 -2.064208 -0.475508
H  0.573238 -1.917457 1.25248
H  -1.571123 1.145038 0.728499
H  -1.232074 -0.226661 1.816304
H  2.419939 -1.240143 -1.142464
H  2.876927 -1.116235 0.579622
H  -2.044628 -1.830877 0.049733
H  -2.248203 -0.485913 -1.101055
H  2.027149 -3.715206 -0.856697
H  2.486207 -3.594111 0.855427
H  1.926408 2.644097 1.649269
H  0.705515 2.28858 -2.257021
H  -3.72869 -0.633198 1.480941
H  4.816119 -2.819793 0.182431
H  4.353849 -2.934436 -1.53942
H  4.435715 -4.41073 -0.536078
H  -4.673278 -0.603628 -1.33771
H  -4.684679 -2.108089 -0.378091
H  -6.215692 -0.98717 1.330674
H  -6.201295 0.503221 0.339953
H  -6.936656 -1.002542 -0.302687
