program: Gaussian 09
title: 000257372
version: EM64L-G09RevD.01
frameworkgroup: C1[X(C14H25BrO4)]
method: RPBEPBE
basis: SDD
operation: Freq
keyword: #p
keyword: freq=noraman
keyword: PBEPBE/SDD
title: #p freq=noraman PBEPBE/SDD
converged: YES YES NO NO
title: Mulliken charges:
elementType: Br O O O O C C C C C C C C C C C C C C H H H H H H H H H H H H H H H H H H H H H H H H H
charge: -0.044222 -0.276018 -0.279683 -0.216238 -0.221573 0.123645 -0.410958 -0.415229 -0.374603 -0.334220 0.177577 0.185087 -0.352595 -0.708028 -0.701477 -0.263313 -0.261580 -0.664686 -0.665458 0.203282 0.221465 0.226075 0.214271 0.206131 0.225005 0.247316 0.251236 0.195534 0.192071 0.276686 0.281611 0.215081 0.215398 0.210956 0.235870 0.221978 0.234563 0.221735 0.218943 0.223395 0.258247 0.218177 0.228642 0.259903
chargesum: 0.00000
title: Mulliken charges with hydrogens summed into heavy atoms:
elementType: Br O O O O C C C C C C C C C C C C C C
charge: -0.044222 -0.276018 -0.279683 -0.216238 -0.221573 0.123645 0.013789 0.025116 0.056533 0.164332 0.177577 0.185087 0.035010 -0.149731 -0.060042 0.194535 0.194718 0.035899 0.041264
polarizability: 2.15643471e+02 -8.79269074e+00 1.73193401e+02 -1.07628488e+01 -7.87040622e-01 1.51521486e+02
1716.lowfreq: -12.7358 -7.5930 -0.0006 -0.0004 -0.0004 1.7117 14.5199 22.5759 25.0536
frequency: 13.3088 21.4698 23.2728 29.6387 32.6072 44.0066 46.2361 54.1728 75.4182 87.6683 100.4197 104.6378 118.1787 140.7118 155.3813 169.8756 181.9535 208.2958 211.4317 227.1440 246.4807 248.8235 260.9485 272.5467 307.9432 323.2809 332.1301 360.6112 420.3733 435.1589 445.8645 520.1834 556.6277 629.4943 645.8675 704.9841 726.8714 737.7168 742.5594 755.2693 763.5052 791.1886 816.2060 818.3981 823.5933 837.9930 892.5445 896.0522 945.3723 972.6029 1006.0289 1010.3950 1023.7613 1035.7049 1047.1028 1071.5500 1077.2149 1079.5392 1088.2692 1096.9623 1098.4715 1112.4817 1124.5412 1147.7068 1155.3547 1156.8604 1202.0856 1223.8655 1237.9644 1262.9916 1272.7332 1275.7439 1279.8089 1290.2001 1295.6200 1298.9967 1326.6176 1333.7942 1349.3563 1352.2003 1356.6426 1364.7293 1390.6813 1392.3479 1393.6541 1444.9315 1449.5603 1455.4484 1456.1110 1462.5304 1463.2141 1463.9418 1465.9423 1473.0376 1475.5813 1477.1939 1484.8671 1484.9500 1487.0374 1617.4690 1648.7321 2961.0932 2973.8043 2978.2018 2990.0320 2992.1807 2992.8032 2993.5263 3005.9592 3021.9498 3028.0460 3029.0092 3036.7557 3044.1858 3052.1677 3061.1319 3071.7991 3073.2824 3086.0787 3086.9343 3087.2200 3093.4580 3094.7074 3118.6061 3119.4628 3130.2740
redmass: 4.0631 2.2906 3.6927 3.2576 2.9644 3.0446 2.4773 3.0505 3.2692 3.9842 4.8996 5.9996 2.6115 2.9776 3.8554 4.0584 2.2057 1.5833 1.7715 1.2065 1.9132 1.8270 3.0818 5.1103 2.7627 3.1955 4.0010 5.5900 3.1648 3.2638 3.3661 6.1303 5.5008 4.7636 2.6898 3.4198 1.2138 3.9758 1.3421 2.6449 2.1073 1.3638 1.5566 1.4670 1.4715 3.3258 1.6856 1.8300 1.5109 5.7086 1.8866 2.6293 2.0389 3.3341 4.3376 3.4904 2.6700 2.1847 3.4632 2.1900 2.1802 1.3225 2.8623 5.1186 1.6683 1.6957 1.7822 1.1919 1.5797 1.3056 1.2372 1.1192 1.1162 1.1231 1.1260 1.2578 1.3715 1.3324 1.4056 1.2918 1.3245 1.4393 1.2147 1.2272 1.2288 1.0931 1.0849 1.0939 1.0936 1.0489 1.0792 1.0431 1.0686 1.0953 1.0705 1.0431 1.0520 1.0520 1.0762 10.1776 10.4797 1.0589 1.0365 1.0611 1.0603 1.0600 1.0362 1.0362 1.0990 1.0606 1.0594 1.0593 1.0989 1.0569 1.0994 1.1025 1.1005 1.1001 1.1038 1.0979 1.0982 1.1031 1.1031 1.1058 1.1057 1.1109
irintensity: 0.7854 0.2553 0.4240 0.6759 1.5185 0.9876 0.1604 0.3844 0.5642 0.4901 0.2441 0.8809 0.2849 0.7866 0.7435 1.6451 2.1937 4.0446 2.9284 0.0232 0.0279 0.2784 2.6770 2.6597 10.1471 1.5305 19.3314 7.6662 2.2396 2.6798 0.9444 16.3803 8.6682 19.5324 2.0449 2.5956 7.3147 6.7558 12.5768 5.3189 12.8924 0.7212 4.1721 0.5973 1.7328 3.3527 5.7186 5.4723 45.0504 5.1699 3.7204 13.3957 308.7345 2.1636 6.3895 20.5163 7.2231 418.0713 5.7055 0.1344 18.6667 10.2490 4.9540 7.8073 19.8066 6.7245 38.2575 20.3635 40.5060 16.6693 8.1198 2.3231 2.4820 5.5958 4.9818 23.7766 19.9771 17.1341 9.3788 1.1567 1.4218 0.3562 11.1815 24.9627 25.7336 1.2952 3.0606 11.2979 8.7372 18.4548 2.6897 19.3425 1.5743 7.0505 6.1637 11.1798 10.1740 25.3848 11.5477 98.0765 168.9374 29.1067 36.0515 6.4615 9.6825 57.6994 18.9255 15.0913 10.1247 5.4895 33.4506 29.0953 1.2913 24.4700 5.4279 12.4609 89.4160 69.4172 20.3289 35.5464 27.3126 2.3958 3.5817 28.8107 27.6490 18.0368
temp: 298.150 k
press: 1.00000 atm
elementType: 35 8 8 8 8 6 6 6 6 6 6 6 6 6 6 6 6 6 6 1 1 1 1 1 1 1 1 1 1 1 1 1 1 1 1 1 1 1 1 1 1 1 1 1
symmnumber: 1
zpe: 971620.2 jmol-1
zpe.correction: 0.370071 hartree
zpe.thermalcorrener: 0.394508 hartree
zpe.thermalcorrenthalpy: 0.395452 hartree
zpe.thermalcorrgfe: 0.309928 hartree
zpe.sumelectzpe: -861.317019 hartree
zpe.sumelectthermal: -861.292581 hartree
zpe.sumelectthermalent: -861.291637 hartree
zpe.sumelectthermalfe: -861.377162 hartree
dipole: 2.3879 0.0911 -2.9649
dipole: 3.8080
quadrupole: -139.5039 -105.8590 -129.5371
quadrupole: -9.6993 -1.8312 -1.3602
quadrupole: -14.5372 19.1077 -4.5704 -9.6993 -1.8312 -1.3602
hfenergy: -861.6870893 hartree
pointgroup: C01 [X(C14H25Br1O4)]
dipole: -1.0257417 0.1812801 1.0768362 debye
polarizability: 218.1296457|4.5956707|172.1873492|-5.4541848|0.7707768|150.0413636 unknown
InChI: InChI=1S/C14H25BrO4/c1-4-7-9-14(10-8-11-15,12(16)18-5-2)13(17)19-6-3/h4-11H2,1-3H3
charge 0 multiplicity 1
44 atoms
Br 5.397018 -1.127538 1.074177
O  -0.91542 -2.125839 0.256446
O  1.109604 2.235952 0.254525
O  0.356862 -1.270107 -1.495009
O  -0.413375 1.617297 -1.392706
C  -0.032702 0.108637 0.54204
C  -1.317096 0.376054 1.408748
C  1.156766 -0.191523 1.520545
C  -2.632931 0.616617 0.638042
C  2.512766 -0.51412 0.841712
C  -0.183383 -1.119328 -0.378857
C  0.198491 1.354738 -0.335678
C  -3.823478 0.838443 1.600169
C  3.590562 -0.699338 1.911649
C  -5.152105 1.082526 0.853049
C  -1.058681 -3.414876 -0.493712
C  1.366236 3.515512 -0.482905
C  -2.24036 -3.349408 -1.464568
C  2.44022 3.312844 -1.554945
H  -1.099675 1.249391 2.056953
H  -1.445124 -0.500022 2.071553
H  1.273964 0.693271 2.172852
H  0.845483 -1.041024 2.159817
H  -2.84737 -0.256576 -0.008802
H  -2.537062 1.488974 -0.035285
H  2.438223 -1.427698 0.225751
H  2.797947 0.312485 0.168882
H  -3.928114 -0.04325 2.265313
H  -3.605484 1.703173 2.260619
H  3.389673 -1.550187 2.581947
H  3.769603 0.215916 2.497466
H  -5.084502 1.977688 0.206792
H  -5.991314 1.234437 1.556434
H  -5.404802 0.222402 0.204782
H  -0.112711 -3.615478 -1.026906
H  -1.214858 -4.158884 0.303811
H  0.41559 3.858731 -0.927516
H  1.691532 4.207852 0.310012
H  -2.382234 -4.336468 -1.942631
H  -3.172542 -3.086063 -0.93519
H  -2.055495 -2.606508 -2.25822
H  2.665766 4.279873 -2.041628
H  3.374365 2.924391 -1.113223
H  2.090448 2.610527 -2.329504
