program: Gaussian 09
title: 000257366
version: EM64L-G09RevD.01
frameworkgroup: C1[X(C16H23N3O)]
method: RPBEPBE
basis: SDD
operation: Freq
keyword: #p
keyword: freq=noraman
keyword: PBEPBE/SDD
title: #p freq=noraman PBEPBE/SDD
converged: YES YES NO NO
title: Mulliken charges:
elementType: O N N N C C C C C C C C C C C C C C C C H H H H H H H H H H H H H H H H H H H H H H H
charge: -0.276538 -0.089616 -0.174133 -0.014416 -0.359095 -0.381073 -0.385199 -0.398141 -0.354053 0.463598 -0.265365 -0.381032 -0.369827 -0.368106 -0.440540 0.448485 -0.218213 -0.812452 -0.445609 -0.150272 0.193923 0.199637 0.211984 0.188309 0.214111 0.205919 0.216575 0.207236 0.200935 0.219366 0.209852 0.194020 0.214736 0.231949 0.222454 0.222713 0.206447 0.208096 0.225117 0.226610 0.221387 0.265051 0.265168
chargesum: 0.00000
title: Mulliken charges with hydrogens summed into heavy atoms:
elementType: O N N N C C C C C C C C C C C C C C C C
charge: -0.276538 -0.089616 -0.174133 -0.014416 0.034465 0.019220 0.034830 0.025670 0.066248 0.463598 0.138508 -0.166296 -0.137878 -0.145652 -0.217826 0.448485 0.196330 -0.139337 0.084609 -0.150272
polarizability: 3.09049302e+02 1.74795198e+00 1.67334419e+02 1.71064249e-01 -8.31404881e+00 1.29577806e+02
1716.lowfreq: -2.1809 -0.0011 -0.0009 -0.0005 2.7480 5.0984 16.2114 21.0536 29.0179
frequency: 16.0388 20.9132 28.9121 47.3035 51.2452 52.6943 61.5948 96.4827 102.2672 111.1716 125.9345 149.7529 169.7886 201.6509 235.4631 263.0971 290.3393 305.0886 325.2288 348.1904 370.0173 373.5159 394.1843 410.0348 441.8470 454.6451 476.8467 509.3399 519.1079 541.1501 606.3873 638.0107 687.1090 713.2472 773.1648 791.6319 795.3520 807.4636 812.2906 816.6843 848.2054 908.3706 920.8014 926.8615 952.3076 953.4125 961.6151 984.2570 1001.1208 1008.7919 1043.2202 1045.6729 1050.2517 1058.4006 1064.3269 1068.6361 1079.0434 1092.4750 1104.3597 1131.4942 1143.0326 1149.7193 1172.6655 1183.9440 1201.2212 1202.2920 1224.9799 1229.0635 1240.6177 1263.3324 1265.5432 1281.7202 1288.3858 1300.2975 1314.7065 1320.0360 1343.7180 1346.7049 1354.5393 1363.2821 1371.4782 1380.4870 1387.7949 1397.6526 1411.2486 1421.9412 1449.8388 1455.2680 1458.1803 1461.9889 1469.1337 1470.5253 1474.7526 1476.8825 1483.9035 1494.1454 1515.9988 1572.3592 1632.3592 2203.0584 2857.3864 2864.6036 2897.9262 2904.6847 2915.9895 2934.5845 2943.4980 2969.8383 2992.8785 2997.6322 3012.7867 3035.8247 3042.5255 3045.2978 3049.1446 3054.3705 3073.2906 3077.3543 3087.4943 3112.0120 3116.3681 3147.3144 3160.0632
redmass: 4.8263 5.9821 2.3159 1.1056 4.4791 3.0245 3.3708 3.9609 3.4431 2.5062 3.9016 6.8102 4.1257 3.3525 2.2104 2.9853 2.6677 3.0992 3.6146 3.3586 3.4613 3.6333 2.2724 2.8749 3.4489 4.0295 2.8293 4.7049 2.6589 5.5259 2.4796 6.7785 3.0068 2.8182 3.0854 4.1460 1.1872 1.5561 1.2686 1.3592 1.5615 6.0991 3.4692 1.4133 2.1290 1.3676 4.3219 1.4460 2.6215 2.6332 2.6863 1.5166 2.3862 1.6380 2.1795 5.1001 1.8754 2.7483 2.4357 1.3770 2.4904 2.1754 1.6466 1.2742 1.1380 1.1215 2.0317 2.4003 1.5615 1.1510 1.1859 1.2955 1.2876 1.3889 1.3221 1.3275 1.4937 1.3909 1.8797 1.5933 2.0252 1.7851 1.3913 1.2389 1.4650 3.4145 1.0785 1.0795 1.0851 1.0964 1.1037 1.0464 1.0872 1.1048 1.0892 1.0781 2.7281 5.7324 6.3777 12.4333 1.0712 1.0698 1.0698 1.0691 1.0708 1.0565 1.0559 1.0372 1.1074 1.1027 1.0585 1.0895 1.0898 1.0977 1.0926 1.0901 1.1021 1.0983 1.0891 1.0883 1.0889 1.0938 1.0933
irintensity: 0.3718 1.2027 0.3329 0.5203 1.6805 1.3186 1.6547 1.4964 4.5295 3.1797 10.0029 1.1106 5.4724 12.1323 1.6319 1.9910 2.1556 3.6278 2.3050 11.8365 4.4586 0.8815 5.0395 0.3437 1.4861 1.6078 2.1821 5.4557 18.4854 3.8134 1.4008 0.1383 8.9679 2.2402 12.2741 1.3976 2.0914 47.0330 16.1003 0.3413 3.0226 10.0341 39.5940 2.9950 1.2809 1.0296 15.0603 3.1916 19.1892 24.3757 55.2043 10.7325 33.4379 0.3945 6.6848 167.0745 4.1421 23.9407 0.8908 6.5007 90.3370 16.0021 9.6653 7.6939 14.0319 0.3342 41.9261 7.2739 122.9291 5.4825 9.9689 3.2042 18.4451 32.5140 10.3725 21.8707 1.7011 3.7484 23.2270 4.3817 11.1197 21.7433 25.6394 7.8195 3.8454 4.3557 13.2144 0.6623 2.5969 36.2131 35.3302 11.7980 10.8152 9.9304 6.1654 5.7104 204.5533 11.6399 78.1157 14.6190 50.5905 72.3289 76.8361 73.7287 116.9619 32.7744 77.7605 64.9635 54.6985 29.5087 5.5879 27.5798 50.1152 26.6051 54.6890 26.0844 8.6036 20.4276 21.1824 17.4789 34.6236 28.7858 13.0497
temp: 298.150 k
press: 1.00000 atm
elementType: 8 7 7 7 6 6 6 6 6 6 6 6 6 6 6 6 6 6 6 6 1 1 1 1 1 1 1 1 1 1 1 1 1 1 1 1 1 1 1 1 1 1 1
symmnumber: 1
zpe: 954682.7 jmol-1
zpe.correction: 0.363619 hartree
zpe.thermalcorrener: 0.384511 hartree
zpe.thermalcorrenthalpy: 0.385455 hartree
zpe.thermalcorrgfe: 0.310038 hartree
zpe.sumelectzpe: -861.400833 hartree
zpe.sumelectthermal: -861.379941 hartree
zpe.sumelectthermalent: -861.378997 hartree
zpe.sumelectthermalfe: -861.454415 hartree
dipole: -2.7896 0.8779 0.7853
dipole: 3.0281
quadrupole: -174.4572 -113.5270 -124.2263
quadrupole: 10.7965 10.7579 -4.4177
quadrupole: -37.0537 23.8765 13.1772 10.7965 10.7579 -4.4177
hfenergy: -861.7644526 hartree
pointgroup: C01 [X(C16H23N3O1)]
dipole: 1.0740322 -0.2294875 0.46158 debye
polarizability: 308.3437071|3.7789738|168.9131289|10.6972916|-2.9404774|128.7046907 unknown
InChI: InChI=1S/C16H23N3O/c1-15-3-5-16(6-4-15)19-10-8-18(9-11-19)12-14-20-13-2-7-17/h3-6H,2,8-14H2,1H3
charge 0 multiplicity 1
43 atoms
O  -4.709422 -0.316796 -0.03703
N  -0.980043 -0.596955 0.076526
N  1.886432 -0.165941 0.176518
N  -9.158061 0.551661 -1.796957
C  -0.418604 0.773491 0.170205
C  -0.088058 -1.542305 0.79015
C  0.981541 0.818246 -0.46209
C  1.326594 -1.530757 0.18317
C  -2.391779 -0.682729 0.520186
C  3.293848 0.002693 0.060137
C  -3.349056 -0.228155 -0.590696
C  3.888014 1.297857 0.162013
C  4.175063 -1.103962 -0.117347
C  5.28281 1.465688 0.093383
C  5.574269 -0.918075 -0.171467
C  6.164058 0.363672 -0.070829
C  -5.735289 0.069334 -1.002137
C  7.669359 0.560194 -0.131088
C  -7.079728 -0.101331 -0.263355
C  -8.23102 0.257894 -1.105569
H  -0.351033 1.109386 1.236421
H  -1.076009 1.478372 -0.36999
H  -0.504501 -2.562561 0.701261
H  -0.01232 -1.291344 1.878677
H  0.886585 0.606149 -1.552258
H  1.392352 1.833642 -0.35134
H  1.968562 -2.180946 0.802492
H  1.284867 -1.959478 -0.845875
H  -2.591774 -0.083491 1.440996
H  -2.625407 -1.735197 0.762826
H  -3.243733 -0.888947 -1.476287
H  -3.139934 0.816912 -0.90737
H  3.260673 2.180233 0.325473
H  3.779922 -2.116805 -0.236878
H  5.698619 2.47774 0.182727
H  6.21822 -1.795937 -0.309361
H  -5.597847 1.123493 -1.326079
H  -5.698077 -0.581257 -1.902149
H  7.958013 1.250138 -0.94682
H  8.061165 0.99049 0.810784
H  8.19232 -0.396917 -0.30219
H  -7.073059 0.528662 0.645154
H  -7.17623 -1.151062 0.069661
