program: Gaussian 09
title: 000257353
version: EM64L-G09RevD.01
frameworkgroup: C1[X(C5H7N5O2)]
method: RPBEPBE
basis: SDD
operation: Freq
keyword: #pfreq=noraman
keyword: PBEPBE/SDD
title: #p freq=noraman PBEPBE/SDD
converged: YES YES NO YES
title: Mulliken charges:
elementType: O O N N N N N C C C C C H H H H H H H
charge: -0.225139 -0.280132 -0.358493 -0.100666 -0.061702 0.046816 -0.567843 0.222520 0.194831 -0.313426 0.001465 -0.611867 0.361050 0.290506 0.249233 0.249285 0.222207 0.336931 0.344424
chargesum: 0.00000
title: Mulliken charges with hydrogens summed into heavy atoms:
elementType: O O N N N N N C C C C C
charge: -0.225139 -0.280132 0.002557 -0.100666 -0.061702 0.046816 0.113512 0.222520 0.194831 -0.022920 0.001465 0.108857
polarizability: 1.61263276e+02 2.82265597e+00 1.25584080e+02 -1.85166457e-03 5.73213211e-03 4.34528596e+01
1716.lowfreq: -5.9712 -4.0457 -0.0015 -0.0013 -0.0011 3.6641 78.1131 79.2298 84.8885
frequency: 78.1097 79.2293 84.8799 145.6176 187.7225 226.8566 238.5378 288.2396 364.9885 380.3480 403.0004 446.2230 535.1118 549.5493 566.4739 608.1325 639.9242 659.5938 708.3496 746.7728 767.5683 771.5830 802.2322 911.8600 960.0501 1018.6623 1048.9610 1108.3963 1118.4318 1169.8141 1210.2325 1248.5513 1297.6011 1324.8625 1346.3618 1421.1509 1439.1825 1450.2058 1457.6696 1484.8408 1502.8928 1564.7939 1591.0129 1620.1048 2993.3312 3074.0837 3116.2531 3166.1119 3357.9019 3549.6903 3708.3944
redmass: 1.2098 4.8806 4.0386 4.7954 3.1578 5.6090 6.6012 8.4317 5.6334 4.5093 6.2802 2.9453 1.2936 7.2864 1.0428 5.2240 7.6385 11.7229 6.5113 5.7492 2.1648 11.3385 2.0169 3.3579 1.4221 2.4653 3.5182 3.9749 1.2912 1.9723 4.1612 2.7345 7.8429 1.7339 8.3001 1.7903 3.3110 1.8783 1.0415 1.1262 2.1309 3.1485 3.6660 2.0975 1.0343 1.1007 1.1014 1.0929 1.0796 1.0445 1.1059
irintensity: 0.0068 0.1690 0.0239 2.8203 2.9081 3.6547 3.4366 17.8494 5.6458 13.5352 0.0843 20.0769 277.5092 0.6047 2.6248 4.7259 1.8813 1.5462 2.1504 2.3786 8.3147 3.6087 133.9979 17.7957 9.9365 16.2924 6.0980 50.5602 1.9074 55.3897 338.1351 8.7239 294.2369 2.1345 9.9938 62.8225 54.7324 19.4439 14.8666 35.7567 44.5063 251.0930 733.7405 375.3036 47.7206 25.1800 18.1091 0.1259 93.9506 175.9972 56.0818
temp: 298.150 k
press: 1.00000 atm
elementType: 8 8 7 7 7 7 7 6 6 6 6 6 1 1 1 1 1 1 1
symmnumber: 1
zpe: 362112.3 jmol-1
zpe.correction: 0.137921 hartree
zpe.thermalcorrener: 0.148789 hartree
zpe.thermalcorrenthalpy: 0.149733 hartree
zpe.thermalcorrgfe: 0.100966 hartree
zpe.sumelectzpe: -617.992758 hartree
zpe.sumelectthermal: -617.981890 hartree
zpe.sumelectthermalent: -617.980946 hartree
zpe.sumelectthermalfe: -618.029713 hartree
dipole: -5.5563 3.1363 0.0005
dipole: 6.3804
quadrupole: -69.0307 -64.8342 -70.1977
quadrupole: 4.7378 -0.0046 -0.0011
quadrupole: -1.0098 3.1867 -2.1769 4.7378 -0.0046 -0.0011
hfenergy: -618.1306796 hartree
pointgroup: C01 [X(C5H7N5O2)]
dipole: 2.0864606 -1.3956713 0.0112797 debye
dipolederiv: -0.7074074 0.2786282 -0.0026859 0.5501835 -0.8762887 0.0010922 -0.0007498 -0.0016296 -0.2433118 -0.849809 -0.1470857 -0.0065752 -0.4310234 -0.6615032 -0.0068629 -0.0085347 -0.0040051 -0.2924244 -0.4942015 -0.4064093 -0.003637 -0.1915642 -1.1468631 -0.0069777 -0.002159 -0.0096119 -0.4293627 -1.1590623 -0.5522176 -0.012931 -0.4350937 -0.7350754 -0.007712 -0.0121399 -0.0088617 -0.2707557 -1.2878249 0.0243702 -0.010169 0.6210141 -0.606863 0.0038538 -0.0060472 -0.0021313 -0.2628577 2.1007178 -0.3036377 0.0165977 -0.2217491 1.1310757 0.0040739 0.0171052 0.0032513 0.2214286 -1.7309481 -0.0943436 -0.0113346 0.1577437 -0.1976092 0.0049434 -0.0095668 0.0023978 -0.6748072 1.0319232 0.6092919 0.0124581 0.1133052 1.2414602 0.0083269 0.0089148 0.0133575 0.2340068 -1.3536819 0.2940466 -0.0115232 -0.2711869 -0.6039354 -0.0069816 -0.0154047 -0.0013322 0.0015172 1.1319608 0.1408738 0.0120791 0.4400102 0.3065841 0.0063312 0.0141547 0.0033486 0.0298726 2.136278 0.1769185 0.0207291 -0.3297662 0.9279584 0.0016745 0.0172798 0.0067438 0.2232455 0.1748084 -0.0787426 -0.0008797 0.0025444 0.5581326 0.0022819 -0.0002996 0.0017966 0.2217487 0.2751332 -0.0709861 -0.0010093 0.0388317 0.273772 -0.0000038 -0.000163 -0.0009959 0.3268273 0.0875375 0.0663202 0.0001134 0.0326698 0.0643152 -0.00007 -0.0001384 0.0002495 0.1220943 0.0463485 0.1044841 -0.0983717 -0.0018395 0.0038003 -0.0102931 -0.0843587 0.0647744 -0.0543594 0.0423768 0.1041938 0.1019191 -0.0033728 0.0048798 0.0112558 0.0863545 -0.0616036 -0.0509439 -0.0358657 -0.1594701 -0.0029906 -0.0661405 -0.0441071 -0.0019913 -0.0022829 -0.002989 0.1257613 0.2785714 -0.0178025 -0.0012379 -0.1120039 0.1636685 -0.002688 -0.0019086 -0.0017273 0.3855837 0.3131453 0.0315678 -0.0005513 0.1074376 0.1965983 -0.0002532 -0.0000558 -0.0010319 0.3867366 unknown
polarizability: 161.4729634|0.0943258|125.3583976|1.1880789|0.5758254|43.4688541 unknown
InChI: InChI=1S/C5H7N5O2/c1-7-4-3(10(11)12)2-8-5(6)9-4/h2,7H,6H2,1H3
charge 0 multiplicity 1
19 atoms
O  -2.543184 1.936633 -0.032382
O  -2.826603 -0.330676 -0.050931
N  -0.687246 -1.912604 -0.041121
N  1.386657 -0.8249 -0.012435
N  1.559635 1.636757 0.006543
N  -2.054457 0.738042 -0.035869
N  3.450001 0.26831 0.016309
C  0.01596 -0.749787 -0.025768
C  -0.627106 0.554972 -0.022988
C  0.212601 1.70024 -0.006577
C  2.084946 0.34419 0.002877
C  -0.046624 -3.231198 -0.044063
H  -1.713085 -1.793088 -0.05028
H  -0.247421 2.693051 -0.004282
H  0.583484 -3.368275 0.85248
H  0.602982 -3.354721 -0.928551
H  -0.833525 -4.001788 -0.058532
H  3.903591 -0.641929 0.014621
H  3.986795 1.132572 0.027954
