program: Gaussian 09
title: 000257327
version: EM64L-G09RevD.01
frameworkgroup: C1[X(C11H14ClNO2)]
method: RPBEPBE
basis: SDD
operation: Freq
keyword: #p
keyword: freq=noraman
keyword: PBEPBE/SDD
title: #p freq=noraman PBEPBE/SDD
converged: NO YES NO NO
title: Mulliken charges:
elementType: Cl O O N C C C C C C C C C C C H H H H H H H H H H H H H H
charge: -0.079246 -0.201297 -0.209711 0.015725 0.118436 0.580895 -0.695067 -0.695343 -0.740566 -0.581438 -0.425387 0.217477 0.297233 -0.328901 -0.665356 0.216402 0.216041 0.226086 0.215251 0.216310 0.226244 0.224264 0.221135 0.221733 0.307654 0.241570 0.264899 0.297443 0.297514
chargesum: 0.00000
title: Mulliken charges with hydrogens summed into heavy atoms:
elementType: Cl O O N C C C C C C C C C C C
charge: -0.079246 -0.201297 -0.209711 0.015725 0.118436 0.580895 -0.036538 -0.037539 -0.073434 -0.273784 -0.183817 0.217477 0.297233 -0.064002 -0.070399
polarizability: 1.94499183e+02 -1.78675922e-02 1.66251287e+02 -2.74045172e-02 1.19832158e-03 8.29194229e+01
1716.lowfreq: -11.2958 -2.9196 -1.7264 -0.0023 0.0008 0.0018 18.4885 33.2747 58.0950
frequency: 18.3601 33.1314 58.0687 127.6516 138.9313 159.9773 175.6558 200.3408 233.9161 237.7375 256.2915 264.0584 310.7386 331.3501 336.8683 342.6150 369.6384 405.8231 425.8019 455.8786 506.2454 552.7064 568.8806 653.8372 660.0579 692.4348 710.8365 714.1105 770.6611 811.6882 841.6985 892.1838 915.1584 922.9065 933.5413 940.5485 943.0006 991.1728 1020.0193 1026.0789 1059.8946 1121.6610 1154.5839 1156.2956 1195.1974 1205.5836 1216.4375 1217.4473 1252.7367 1268.2841 1287.7741 1346.7372 1366.9252 1377.9917 1380.0037 1407.9025 1411.5195 1418.3974 1460.0664 1464.8079 1467.5826 1480.0799 1487.4853 1492.0869 1501.2833 1553.0777 1620.4878 2974.9636 2975.5408 2980.5802 3070.7669 3072.3225 3072.8365 3073.9115 3078.1979 3079.6206 3082.4478 3137.7756 3145.3565 3173.1879 3189.2358
redmass: 7.2140 3.6523 4.8657 5.7033 3.3339 4.1205 8.5957 1.2344 2.0754 3.6377 1.6081 1.9808 1.0437 5.4680 3.4070 2.5267 5.2665 2.7613 3.5150 3.7274 2.9101 6.5721 4.2081 7.2318 5.5314 2.6948 7.6853 7.8875 7.1056 3.3684 1.4074 3.8441 1.7004 1.6541 1.6582 1.4129 1.2159 1.3767 1.4054 1.3830 3.2099 2.4015 1.0764 1.8379 3.2858 3.0176 3.3922 2.2630 1.4573 2.1283 1.6657 3.8591 5.9623 1.1822 1.2522 1.2284 3.7883 1.1914 1.0503 1.0482 1.0809 1.0958 1.0540 1.5713 1.4132 6.8243 6.8527 1.0348 1.0350 1.0361 1.1009 1.0577 1.1003 1.1000 1.0998 1.0994 1.0988 1.0892 1.1079 1.0936 1.0905
irintensity: 0.7168 0.4958 0.0619 0.0247 1.9989 4.2807 6.1446 0.0312 0.8824 0.0895 0.0664 0.0647 0.0182 3.5298 2.0370 0.2018 1.0485 2.3540 0.2605 0.1106 0.2626 17.0775 16.8099 7.1021 19.4172 4.8780 62.4406 3.5131 10.1274 7.7443 14.4180 16.2047 8.7706 11.0274 2.3761 4.5251 1.4923 3.3919 0.9935 0.4420 13.1696 7.3066 0.0004 29.4627 214.0111 5.8418 79.5627 0.4716 12.5258 28.0171 5.6578 25.5183 155.9792 19.0014 21.0728 9.1309 16.4141 8.3301 0.0514 0.6112 2.5558 17.5326 13.6590 10.2341 71.7274 9.0850 1.1806 30.0298 29.3058 16.9683 5.8757 4.6893 0.5752 9.5484 43.0113 44.2216 102.9096 11.1065 0.4901 3.2672 3.7470
temp: 298.150 k
press: 1.00000 atm
elementType: 17 8 8 7 6 6 6 6 6 6 6 6 6 6 6 1 1 1 1 1 1 1 1 1 1 1 1 1 1
symmnumber: 1
zpe: 600702.9 jmol-1
zpe.correction: 0.228796 hartree
zpe.thermalcorrener: 0.244137 hartree
zpe.thermalcorrenthalpy: 0.245082 hartree
zpe.thermalcorrgfe: 0.185042 hartree
zpe.sumelectzpe: -1091.624212 hartree
zpe.sumelectthermal: -1091.608870 hartree
zpe.sumelectthermalent: -1091.607926 hartree
zpe.sumelectthermalfe: -1091.667966 hartree
dipole: -4.2903 -2.7815 0.0007
dipole: 5.1131
quadrupole: -96.8229 -108.9436 -96.2367
quadrupole: 0.9028 0.0068 -0.0137
quadrupole: 3.8448 -8.2759 4.4310 0.9028 0.0068 -0.0137
hfenergy: -1091.8530079 hartree
pointgroup: C01 [X(C11H14Cl1N1O2)]
dipole: -1.9083813 0.6197675 0.143746 debye
polarizability: 191.8852996|6.9638458|168.1383852|-8.796009|-1.7539705|83.6462087 unknown
InChI: InChI=1S/C11H14ClNO2/c1-11(2,3)9-5-4-8(7-12)10(6-9)13(14)15/h4-6H,7H2,1-3H3
charge 0 multiplicity 1
29 atoms
Cl 3.211761 3.132471 -0.413076
O  1.460674 -2.796936 -0.191547
O  3.195825 -1.337242 -0.346866
N  1.928857 -1.596032 -0.243714
C  -2.885437 -0.124377 0.121293
C  -1.380997 0.198828 -0.003312
C  -3.634203 0.457196 -1.11611
C  -3.443135 0.53313 1.420264
C  -3.15421 -1.649112 0.188219
C  -0.387177 -0.796756 -0.068653
C  -0.936222 1.548912 -0.059759
C  0.982293 -0.457275 -0.183537
C  1.440806 0.893553 -0.239721
C  0.426961 1.880525 -0.17342
C  2.911749 1.259877 -0.362144
H  -4.717042 0.24893 -1.034563
H  -3.506531 1.551641 -1.197878
H  -3.264497 0.000914 -2.052536
H  -3.310018 1.629935 1.417845
H  -4.525112 0.325453 1.512543
H  -2.936532 0.130812 2.316432
H  -4.240235 -1.827818 0.284559
H  -2.810765 -2.168805 -0.725366
H  -2.6614 -2.116226 1.060867
H  -0.635873 -1.859067 -0.033449
H  -1.666546 2.364522 -0.013551
H  0.726999 2.93068 -0.213414
H  3.365168 0.879734 -1.287682
H  3.50644 0.905333 0.490676
