program: Gaussian 09
title: 000257320
version: EM64L-G09RevD.01
frameworkgroup: C1[X(C20H21N3O2)]
method: RPBEPBE
basis: SDD
operation: Freq
keyword: #p
keyword: freq=noraman
keyword: PBEPBE/SDD
title: #p freq=noraman PBEPBE/SDD
converged: YES YES NO NO
title: Mulliken charges:
elementType: O O N N N C C C C C C C C C C C C C C C C C C C C H H H H H H H H H H H H H H H H H H H H H
charge: -0.193742 -0.196982 -0.334902 -0.324657 -0.280306 -0.324552 -0.391838 -0.375968 0.171017 0.143902 -0.358011 0.080474 0.491692 0.400392 -0.700803 -0.317594 -0.327518 -0.344925 -0.341480 -0.216768 -0.214666 -0.217633 -0.204353 -0.236355 -0.233178 0.275275 0.219197 0.240457 0.243157 0.173054 0.202955 0.193585 0.207512 0.214966 0.215685 0.252504 0.249974 0.246063 0.258672 0.266499 0.227605 0.233785 0.228131 0.235082 0.229079 0.235516
chargesum: 0.00000
title: Mulliken charges with hydrogens summed into heavy atoms:
elementType: O O N N N C C C C C C C C C C C C C C C C C C C C
charge: -0.193742 -0.196982 -0.334902 -0.324657 -0.013807 -0.049277 0.067816 0.040243 0.171017 0.143902 0.038529 0.080474 0.491692 0.400392 -0.062640 -0.065090 -0.077544 -0.098862 -0.082808 0.010837 0.019119 0.010498 0.030729 -0.007275 0.002337
polarizability: 2.70595095e+02 1.57667116e+01 2.65037322e+02 -7.34154338e+00 -7.35564927e+00 1.83747122e+02
1716.lowfreq: -7.1545 -5.4724 -0.0001 0.0007 0.0010 4.4102 14.6236 26.3471 29.8026
frequency: 14.5796 26.3074 29.6618 31.2965 43.9457 48.0112 57.9808 62.3642 94.4367 115.7194 121.3680 132.0340 143.4617 214.3163 224.0850 230.5570 237.8177 261.0718 276.5802 293.3545 299.6829 395.3528 403.6959 406.6509 407.1503 414.4682 423.2275 463.5562 490.7396 503.7822 529.3484 565.6352 600.8026 611.7717 616.7657 619.7558 652.6984 686.4708 688.8971 695.3276 704.2355 729.5605 751.9947 757.4516 776.0844 787.1863 803.8408 810.5878 839.0510 846.8585 884.9367 894.7802 917.6026 921.8396 935.1125 967.9154 969.0166 975.9329 990.5996 992.0324 992.6137 998.7697 1016.1308 1023.8815 1027.0906 1052.7916 1069.5998 1075.5733 1079.2528 1082.6232 1091.2822 1121.2534 1130.7028 1156.0051 1172.0717 1174.3108 1181.1581 1183.1410 1194.2081 1204.5867 1208.5921 1237.6801 1256.5081 1273.5055 1291.7659 1300.9486 1310.8025 1314.9272 1320.6577 1337.1753 1339.6267 1358.2076 1382.6624 1384.3228 1387.2217 1439.1430 1439.5126 1461.5696 1467.0263 1476.1388 1477.6510 1479.8819 1481.3454 1487.0566 1592.1814 1596.4108 1602.9086 1605.7583 1609.7702 1611.4643 1652.8228 2926.4146 2952.8988 2967.7651 2971.7200 3004.4034 3011.4687 3038.4443 3066.3723 3071.1170 3073.6304 3130.0788 3134.7483 3142.4270 3143.1524 3154.0874 3156.5347 3163.4716 3168.7042 3174.7227 3178.2922 3402.8418
redmass: 4.1278 3.6426 3.7420 5.1530 5.4900 3.4769 2.2810 5.3899 4.4682 3.5372 3.5206 4.1061 4.7596 3.3286 1.7188 5.0473 2.0672 5.1779 5.0642 4.2906 4.4355 4.3502 4.8946 3.0588 2.9113 5.8613 5.8429 5.1368 4.1503 3.7000 4.2491 7.8135 5.6468 6.5118 8.0522 6.2743 6.6896 4.5115 3.5177 1.9748 1.6893 1.2209 1.7742 1.8861 2.7381 2.6485 1.7255 1.4814 1.2505 1.2467 2.5741 1.8049 1.4466 1.4871 2.0605 1.6480 1.7171 1.3932 5.9859 3.1956 1.6421 1.3329 3.6875 2.1963 2.6385 2.8522 1.7893 2.1004 1.6661 1.6599 1.8558 2.2534 2.5162 4.3357 1.0522 1.0531 1.1760 1.1257 2.0524 2.3293 1.4192 2.1700 1.7684 1.4255 1.0912 1.2899 1.7338 1.3202 2.6483 2.3035 2.3820 1.6162 9.6953 10.1861 1.2165 2.2358 2.2280 1.0818 1.0671 1.0591 1.0539 2.3332 2.3744 1.0822 6.7983 7.6380 7.4753 6.4671 7.3797 7.4092 10.0192 1.0792 1.0651 1.0591 1.0370 1.0619 1.0942 1.0980 1.1013 1.0999 1.1020 1.0851 1.0853 1.0894 1.0887 1.0932 1.0943 1.0971 1.0975 1.1016 1.0990 1.0759
irintensity: 0.1990 0.2690 0.3227 1.2746 0.8004 0.1433 0.4790 0.7273 0.6031 1.9226 0.6809 2.0540 0.7492 1.4855 0.4012 5.5139 2.0610 5.4784 9.0326 5.3102 3.0617 1.3072 4.8426 1.1210 0.2708 1.3096 6.3246 4.1509 8.3792 1.0518 52.5544 37.1515 0.7679 0.9027 2.0956 0.4714 0.7445 8.3160 4.3836 49.8921 35.7548 23.4834 28.3805 49.9580 1.0254 7.6391 6.4215 53.7191 0.2380 2.6045 2.3760 13.5994 5.8993 3.0847 3.1578 4.9485 3.8576 0.4097 3.8686 1.1382 1.1167 0.0754 0.5321 16.1321 3.9757 2.7799 73.1898 12.5915 3.0743 45.1061 23.6055 2.8917 12.4285 19.4541 0.0066 0.0175 15.3333 2.0588 45.2011 5.4451 9.7613 23.6036 5.5791 16.2907 3.7414 51.2335 155.8883 1.2515 238.2775 211.8756 162.5229 0.8245 1.1075 3.0292 11.7121 6.0985 11.5380 11.3569 0.0628 6.6762 10.6656 65.1005 30.5573 16.9866 215.5939 111.2647 63.3720 18.1319 221.1196 146.6519 40.3797 8.4009 16.2416 51.6460 36.1272 16.8529 12.9151 8.4935 23.1811 48.9293 77.8338 0.0047 0.5675 11.3887 3.6689 22.0150 36.9499 17.3701 14.5575 10.8055 3.0216 19.9438
temp: 298.150 k
press: 1.00000 atm
elementType: 8 8 7 7 7 6 6 6 6 6 6 6 6 6 6 6 6 6 6 6 6 6 6 6 6 1 1 1 1 1 1 1 1 1 1 1 1 1 1 1 1 1 1 1 1 1
symmnumber: 1
zpe: 966803.6 jmol-1
zpe.correction: 0.368236 hartree
zpe.thermalcorrener: 0.391311 hartree
zpe.thermalcorrenthalpy: 0.392255 hartree
zpe.thermalcorrgfe: 0.311877 hartree
zpe.sumelectzpe: -1087.647991 hartree
zpe.sumelectthermal: -1087.624916 hartree
zpe.sumelectthermalent: -1087.623972 hartree
zpe.sumelectthermalfe: -1087.704350 hartree
dipole: -3.1373 0.4898 1.3170
dipole: 3.4376
quadrupole: -136.6199 -146.9973 -138.7559
quadrupole: 3.4231 1.7550 -8.6954
quadrupole: 4.1711 -6.2062 2.0351 3.4231 1.7550 -8.6954
hfenergy: -1088.016227 hartree
pointgroup: C01 [X(C20H21N3O2)]
dipole: -1.1138465 0.4614746 0.6127928 debye
polarizability: 275.8355533|12.7646928|258.3979664|-15.0075783|-4.0335372|185.146019 unknown
InChI: InChI=1S/C20H21N3O2/c1-2-3-14-17-18(24)22(15-10-6-4-7-11-15)20(21)23(19(17)25)16-12-8-5-9-13-16/h4-13,17,21H,2-3,14H2,1H3
charge 0 multiplicity 1
46 atoms
O  2.59887 -0.118352 -0.790535
O  -1.333991 -2.586348 -0.473564
N  0.730748 0.916231 0.160082
N  -1.326726 -0.362946 0.240651
N  -1.162133 1.882883 1.180386
C  0.837475 -1.575691 0.105521
C  1.536146 -2.760524 -0.597587
C  2.849414 -3.194063 0.090949
C  1.472384 -0.221796 -0.243847
C  -0.683275 -1.578725 -0.099202
C  3.519152 -4.384701 -0.630691
C  -0.630627 0.852371 0.587418
C  1.381127 2.225143 0.103234
C  -2.783609 -0.327068 0.270939
C  4.820122 -4.848415 0.059496
C  1.682895 2.914608 1.296391
C  -3.488362 -1.125777 1.198412
C  1.722679 2.767921 -1.15359
C  -3.477787 0.498646 -0.642971
C  2.328222 4.168185 1.227184
C  -4.899837 -1.093307 1.212934
C  2.373563 4.019925 -1.21533
C  -4.889163 0.533328 -0.616921
C  2.675325 4.722963 -0.026698
C  -5.60249 -0.262536 0.30955
H  0.977991 -1.690863 1.206124
H  1.746946 -2.479662 -1.646428
H  0.823973 -3.605599 -0.621906
H  3.551926 -2.34019 0.121326
H  2.636659 -3.481168 1.143613
H  3.739093 -4.094669 -1.678098
H  2.803867 -5.230894 -0.684383
H  4.623943 -5.174356 1.098713
H  5.560148 -4.027107 0.099714
H  5.28421 -5.695721 -0.478139
H  1.395015 2.484756 2.259427
H  -2.937845 -1.773653 1.887463
H  1.497779 2.210664 -2.067983
H  -2.917852 1.101622 -1.365822
H  -2.165222 1.759961 1.407123
H  2.558038 4.710465 2.150705
H  -5.448468 -1.71629 1.927153
H  2.646284 4.441336 -2.188865
H  -5.428434 1.17336 -1.323216
H  3.178441 5.6950 -0.076642
H  -6.697417 -0.23895 0.324009
