program: Gaussian 09
title: 000257317
version: EM64L-G09RevD.01
frameworkgroup: C1[X(C15H18N2O3)]
method: RPBEPBE
basis: SDD
operation: Freq
keyword: #p
keyword: freq=noraman
keyword: PBEPBE/SDD
title: #p freq=noraman PBEPBE/SDD
converged: YES YES NO NO
title: Mulliken charges:
elementType: O O O N N C C C C C C C C C C C C C C C H H H H H H H H H H H H H H H H H H
charge: -0.212237 -0.217061 -0.219595 -0.376318 -0.384717 0.115316 -0.505066 -0.238732 -0.418371 0.153427 0.168575 0.526215 -0.739462 -0.704386 0.146382 -0.466823 -0.392818 -0.221743 -0.249668 -0.246110 0.263898 0.237792 0.242446 0.253695 0.216969 0.237068 0.205168 0.230484 0.239211 0.253550 0.220088 0.366279 0.365475 0.239598 0.235165 0.224815 0.223717 0.227775
chargesum: 0.00000
title: Mulliken charges with hydrogens summed into heavy atoms:
elementType: O O O N N C C C C C C C C C C C C C C C
charge: -0.212237 -0.217061 -0.219595 -0.010039 -0.019242 0.115316 -0.003376 0.003714 0.052293 0.153427 0.168575 0.526215 -0.066742 0.008462 0.146382 -0.227226 -0.157653 0.003072 -0.025950 -0.018335
polarizability: 2.30044294e+02 1.74718497e+01 1.57800987e+02 1.65620235e+01 -1.87102676e+01 1.48721074e+02
1716.lowfreq: -6.7994 -2.3589 -0.0009 -0.0007 -0.0005 9.5210 27.1008 30.1275 34.3503
frequency: 27.0409 30.1218 34.3391 65.6984 92.2210 105.1774 134.1967 140.9712 157.0318 169.9576 191.9307 208.5046 224.8276 257.8818 267.2020 279.2403 304.8698 336.3070 356.3560 363.7636 403.5676 405.9773 462.8436 481.6451 494.9218 540.7998 575.0882 600.2644 616.3240 632.3308 659.5203 673.0798 701.3954 708.6670 740.2525 758.6259 763.0456 780.8419 787.8917 791.8664 836.9761 855.3732 883.4270 921.8381 928.1232 958.8339 977.6262 989.9189 991.5009 994.4489 1015.3801 1019.0985 1034.4141 1046.6199 1070.5137 1087.1584 1117.8230 1131.0858 1154.3934 1171.7655 1189.8714 1197.4199 1216.5500 1255.9091 1280.4902 1292.2757 1306.5398 1324.8020 1335.9625 1345.8783 1357.3918 1364.0684 1375.8456 1376.0590 1387.7614 1393.3437 1406.5063 1443.6280 1449.6108 1468.7479 1473.0651 1477.4790 1478.9772 1487.1271 1489.7857 1592.6330 1612.3691 1613.0708 1648.5288 1676.7334 2977.9303 2979.5652 2996.5614 3004.2122 3011.5570 3043.9963 3064.3035 3076.3766 3086.5908 3089.7059 3104.5869 3116.5502 3118.2622 3132.5555 3143.3384 3161.6400 3518.0970 3519.9369
redmass: 4.9664 5.3190 5.4715 3.8054 4.0962 2.4934 4.6898 5.3390 7.7479 4.4522 2.1944 3.5450 2.1271 1.2240 1.7010 3.3262 2.4380 3.1679 8.0959 8.0966 5.0461 2.8758 4.4064 6.9878 2.8223 3.2883 4.6963 6.6110 6.3729 4.4329 2.5101 2.3232 6.6290 1.7124 3.8159 1.8313 2.3935 1.5718 1.6692 1.9980 1.8492 1.2458 2.3021 1.4776 3.4664 1.6695 1.3928 5.6689 3.5328 1.3210 2.0561 2.1241 1.8363 2.5254 2.1017 1.7006 2.8050 2.5739 2.9051 1.0569 1.1144 3.0815 2.3800 1.4069 1.3603 1.9374 1.8594 1.3125 1.4625 1.3412 1.5957 6.9898 1.4629 2.1427 3.6058 1.2264 1.2011 2.0621 1.0858 1.0824 1.0707 1.0500 1.4009 1.4299 1.0553 5.9031 6.1479 6.6825 8.3445 5.5412 1.0369 1.0602 1.0371 1.0818 1.0616 1.1015 1.0967 1.1027 1.0986 1.1002 1.1008 1.0850 1.0877 1.0912 1.0959 1.1015 1.0758 1.0781
irintensity: 0.0632 0.2306 0.1776 0.2912 0.2878 0.0515 2.7710 0.6131 8.2582 2.2570 0.4056 0.6589 1.4149 1.1392 1.3287 0.9278 2.1831 3.9616 17.6097 17.0335 0.5951 0.0041 24.6655 14.4948 4.2567 15.1501 4.1045 0.3848 0.0350 4.0446 2.7891 21.0518 1.4605 49.4016 25.0625 12.9851 14.5303 22.1332 205.9066 23.0230 0.8017 0.0232 4.3421 3.2567 2.7473 6.7205 0.4096 0.0270 1.4224 0.1277 24.0133 22.2319 1.0993 8.8581 6.2401 8.3283 7.9940 9.8475 25.8511 0.2292 0.1353 24.9156 8.8641 24.4458 14.8579 158.0464 96.5568 3.6036 88.6011 26.1065 8.0944 187.5707 2.4549 5.1015 2.0179 16.7307 23.7999 7.7014 12.5897 7.0450 7.3304 8.9780 13.8360 22.1297 11.2406 6.6113 42.1521 235.5010 78.9753 642.4571 36.0430 23.3005 21.0288 5.0181 15.5056 7.8865 60.3305 3.2632 31.0294 17.5213 24.7441 9.5877 1.4465 13.3178 41.0438 26.0816 85.2412 48.1984
temp: 298.150 k
press: 1.00000 atm
elementType: 8 8 8 7 7 6 6 6 6 6 6 6 6 6 6 6 6 6 6 6 1 1 1 1 1 1 1 1 1 1 1 1 1 1 1 1 1 1
symmnumber: 1
zpe: 807342.4 jmol-1
zpe.correction: 0.307500 hartree
zpe.thermalcorrener: 0.326482 hartree
zpe.thermalcorrenthalpy: 0.327426 hartree
zpe.thermalcorrgfe: 0.259258 hartree
zpe.sumelectzpe: -916.149679 hartree
zpe.sumelectthermal: -916.130698 hartree
zpe.sumelectthermalent: -916.129754 hartree
zpe.sumelectthermalfe: -916.197921 hartree
dipole: 0.2836 1.0767 0.7672
dipole: 1.3522
quadrupole: -121.0469 -119.5689 -121.9781
quadrupole: -4.9741 -4.0614 1.5316
quadrupole: -0.1822 1.2957 -1.1135 -4.9741 -4.0614 1.5316
hfenergy: -916.4571795 hartree
pointgroup: C01 [X(C15H18N2O3)]
dipole: 0.0993419 -0.3998792 -0.336509 debye
polarizability: 228.8145232|-17.3581256|161.1072682|-19.8786084|-17.1693613|146.644563 unknown
InChI: InChI=1S/C15H18N2O3/c1-3-15(12(18)16-14(20)17-13(15)19)9-10(2)11-7-5-4-6-8-11/h4-8,10,16-17H,3,9H2,1-2H3
charge 0 multiplicity 1
38 atoms
O  -1.259914 1.516179 -1.869156
O  -1.485776 -1.920511 1.543767
O  -4.71894 1.396248 1.232229
N  -2.977522 1.399945 -0.329496
N  -3.113413 -0.303474 1.299046
C  -1.340611 -0.503789 -0.469462
C  0.21651 -0.578105 -0.437246
C  0.96619 0.592515 0.270831
C  -1.904296 -1.499651 -1.583306
C  -1.81598 0.881062 -0.936327
C  -1.94023 -0.9602 0.869842
C  2.47395 0.326374 0.192484
C  0.505912 0.833432 1.732563
C  -1.450634 -2.966048 -1.449236
C  -3.682414 0.864544 0.763714
C  3.302746 1.126324 -0.63373
C  3.072071 -0.733662 0.924462
C  4.692624 0.881904 -0.725285
C  4.45946 -0.981034 0.837047
C  5.276531 -0.173829 0.010737
H  0.48298 -1.531405 0.052583
H  0.575957 -0.626953 -1.481434
H  0.764297 1.515309 -0.306483
H  -1.568453 -1.08693 -2.55334
H  -3.011794 -1.449685 -1.574012
H  1.11991 1.623923 2.199069
H  -0.547994 1.168626 1.77958
H  0.595277 -0.079554 2.347248
H  -0.3592 -3.068307 -1.571898
H  -1.723953 -3.397415 -0.471811
H  -1.934414 -3.567437 -2.240403
H  -3.345029 2.279932 -0.706777
H  -3.570415 -0.674781 2.138661
H  2.854126 1.945431 -1.209577
H  2.453573 -1.366476 1.573136
H  5.316645 1.513235 -1.368182
H  4.904333 -1.801589 1.411741
H  6.353387 -0.365245 -0.056883
