program: Gaussian 09
title: 000257212
version: EM64L-G09RevD.01
frameworkgroup: C1[X(C13H17N3O4S)]
method: RPBEPBE
basis: SDD
operation: Freq
keyword: #p
keyword: freq=noraman
keyword: PBEPBE/SDD
title: #p freq=noraman PBEPBE/SDD
converged: YES YES NO NO
title: Mulliken charges:
elementType: S O O O O N N N C C C C C C C C C C C C C H H H H H H H H H H H H H H H H H
charge: 0.910290 -0.527563 -0.530300 -0.271085 -0.277519 -0.242142 -0.424159 -0.617516 -0.170180 -0.423716 -0.411629 -0.474841 -0.453780 0.248591 0.021567 -0.238901 -0.282374 -0.204158 -0.204838 0.238803 -0.217503 0.201101 0.270170 0.217878 0.212383 0.280380 0.237945 0.286504 0.253059 0.235410 0.337542 0.274730 0.295423 0.241603 0.242616 0.238655 0.341678 0.385876
chargesum: 0.00000
title: Mulliken charges with hydrogens summed into heavy atoms:
elementType: S O O O O N N N C C C C C C C C C C C C C
charge: 0.910290 -0.527563 -0.530300 -0.271085 -0.277519 -0.242142 -0.086617 0.110037 0.030920 0.064332 0.081134 0.049608 0.034689 0.248591 0.021567 0.035830 0.013049 0.037445 0.037778 0.238803 0.021152
polarizability: 2.74593455e+02 -6.41114681e+00 1.66061064e+02 -5.64287525e+00 -6.05145492e+00 1.57587435e+02
1716.lowfreq: -21.0651 -5.0609 -1.2512 -0.0010 -0.0007 0.0006 6.4564 8.9079 25.6323
frequency: -13.2359 6.4237 25.5155 33.0946 63.3425 71.9305 103.9472 132.3566 133.3732 156.0161 187.1786 198.6703 219.9943 225.5387 245.8813 253.2591 283.1641 308.3519 330.6875 369.2506 379.3757 396.2504 403.6304 417.7020 437.3272 464.9892 476.0437 504.8229 542.0335 576.1795 602.1053 602.7277 659.9601 662.6741 689.3426 697.1269 746.0354 758.4344 759.7603 777.9584 786.5114 792.2931 795.6885 840.6585 848.6123 908.3964 919.6813 927.8651 933.8742 948.4281 953.2359 978.0840 983.7115 1005.6984 1008.6567 1017.0250 1033.1732 1049.0041 1077.4985 1089.9910 1101.6784 1105.1133 1127.3613 1142.6709 1167.3364 1173.8773 1178.5848 1242.5978 1249.3040 1279.1066 1290.7001 1303.5995 1314.4610 1323.6543 1339.1269 1344.6791 1360.9526 1370.3406 1383.6206 1428.9355 1436.5799 1437.4787 1440.0680 1452.8467 1460.2204 1474.2133 1554.6389 1577.2815 1604.5246 1625.6823 1692.9299 2951.3228 2970.9724 2975.6809 2997.0482 3001.7644 3054.0943 3057.4090 3069.0890 3074.0860 3137.5733 3148.2841 3157.2867 3166.9879 3176.1225 3367.6300 3537.9851 3649.5905
redmass: 5.6375 8.8350 5.6511 4.6690 6.2803 4.1545 6.5988 7.5774 5.4806 3.7682 5.1259 6.5829 4.9182 4.0519 7.9040 4.6186 5.9027 3.2232 3.7257 3.5253 4.3262 4.8489 2.8334 5.7854 4.2506 3.2810 3.8014 4.4153 3.3136 1.1744 3.3807 4.8239 6.8709 1.5450 2.3688 3.4254 3.4618 3.3857 1.5024 3.1445 1.3294 2.1539 3.9115 2.8755 1.2485 2.9688 4.2882 7.0197 1.3949 2.5267 1.7956 5.5883 1.4199 1.3335 4.1173 2.5711 2.5199 2.1535 1.5525 2.5978 2.1295 2.1078 4.7549 1.3278 1.8057 1.0584 1.1229 1.2390 1.3469 1.3167 1.2726 1.2991 1.2595 1.2351 1.2879 2.1779 1.7424 1.3469 8.2930 2.2165 1.8542 1.1794 1.1143 2.0282 1.0804 1.0831 1.6151 5.8155 6.9392 2.7570 6.2195 1.0831 1.0653 1.0665 1.0614 1.0621 1.0956 1.0958 1.1025 1.1022 1.0858 1.0887 1.0929 1.0969 1.1012 1.0597 1.0774 1.0927
irintensity: 0.6647 0.6288 0.2801 0.8253 1.4934 0.7209 1.1596 3.4753 5.8095 1.4041 0.5560 9.1253 6.8917 5.9881 11.6448 2.4673 5.0866 1.5074 25.1278 27.5564 7.4658 8.3246 0.0726 5.8071 29.9928 2.2717 24.3788 77.1261 9.3844 120.4438 78.5701 31.3237 21.7281 38.5462 32.7072 41.2086 105.4361 7.1643 68.5085 62.8057 89.4769 17.4761 39.4502 16.2033 0.9995 4.4214 47.7825 48.8662 2.1067 27.4068 6.3422 2.9917 0.2124 0.1410 1.9957 1.7416 14.5606 22.3377 5.8704 4.2798 20.0348 7.2382 16.6345 4.7254 122.4302 0.2633 5.5920 13.9490 5.5320 3.7005 5.7016 3.9065 17.2596 19.3389 9.4671 322.7521 157.2890 12.8337 5.4214 116.0455 34.9407 13.4541 11.4668 16.6574 10.9512 25.6831 441.8340 3.4368 0.5172 45.7398 445.2885 31.2229 6.7882 33.7469 28.9581 16.3486 17.2285 3.0056 8.3611 17.9113 1.0380 10.4354 1.9858 7.8863 24.6492 150.5578 31.9729 100.1071
temp: 298.150 k
press: 1.00000 atm
elementType: 16 8 8 8 8 7 7 7 6 6 6 6 6 6 6 6 6 6 6 6 6 1 1 1 1 1 1 1 1 1 1 1 1 1 1 1 1 1
symmnumber: 1
zpe: 773252.0 jmol-1
zpe.correction: 0.294516 hartree
zpe.thermalcorrener: 0.314153 hartree
zpe.thermalcorrenthalpy: 0.315097 hartree
zpe.thermalcorrgfe: 0.243748 hartree
zpe.sumelectzpe: -1367.092411 hartree
zpe.sumelectthermal: -1367.072774 hartree
zpe.sumelectthermalent: -1367.071830 hartree
zpe.sumelectthermalfe: -1367.143179 hartree
dipole: 4.2870 -1.9813 -3.9555
dipole: 6.1604
quadrupole: -128.9177 -132.4687 -134.7547
quadrupole: -17.4390 -16.7394 -8.8472
quadrupole: 3.1293 -0.4216 -2.7077 -17.4390 -16.7394 -8.8472
hfenergy: -1367.3869271 hartree
pointgroup: C01 [X(C13H17N3O4S1)]
dipole: 1.6076349 1.6809999 0.6811283 debye
polarizability: 273.7532738|12.5821894|156.848304|4.0079468|-4.2708722|167.6403762 unknown
InChI: InChI=1S/C13H17N3O4S/c14-13(18)15-12(17)10-6-8-16(9-7-10)21(19,20)11-4-2-1-3-5-11/h1-5,10,15H,6-9,14H2
charge 0 multiplicity 1
38 atoms
S  1.818863 -0.778379 -0.123443
O  1.317474 -0.933083 -1.675249
O  1.968965 -2.074159 0.85635
O  -3.535182 -1.331395 -0.75451
O  -6.77831 1.372173 -0.47508
N  0.757235 0.486123 0.867667
N  -4.589398 0.654785 -0.108482
N  -6.107453 -0.721821 -1.304006
C  -2.199365 0.341076 0.446078
C  -1.457839 -0.762573 1.239894
C  -1.260603 0.886514 -0.671518
C  -0.135159 -0.224005 1.829427
C  0.054202 1.422601 -0.05734
C  -3.485903 -0.198112 -0.180735
C  3.471773 0.137448 -0.184099
C  4.243831 0.202444 0.98696
C  3.868982 0.670002 -1.420164
C  5.491348 0.863044 0.908897
C  5.120981 1.327432 -1.476598
C  -5.917251 0.464471 -0.645607
C  5.923998 1.425675 -0.3165
H  -2.448886 1.177136 1.135712
H  -1.263994 -1.618746 0.568681
H  -2.090493 -1.136058 2.067551
H  -1.752549 1.70504 -1.231584
H  -1.032168 0.075061 -1.385626
H  -0.337474 0.518451 2.629161
H  0.448256 -1.047851 2.277442
H  0.755562 1.719007 -0.857833
H  -0.146679 2.328317 0.551831
H  -4.493846 1.550257 0.377562
H  3.893668 -0.255315 1.917041
H  3.231315 0.548713 -2.302088
H  6.123074 0.93379 1.800378
H  5.466791 1.753169 -2.424196
H  6.893042 1.93374 -0.36802
H  -7.027828 -0.89979 -1.699377
H  -5.327178 -1.390581 -1.377778
