program: Gaussian 09
title: 000257193
version: EM64L-G09RevD.01
frameworkgroup: C1[X(C14H14N2O)]
method: RPBEPBE
basis: SDD
operation: Freq
keyword: #p
keyword: freq=noraman
keyword: PBEPBE/SDD
title: #p freq=noraman PBEPBE/SDD
converged: YES YES NO NO
title: Mulliken charges:
elementType: O N N C C C C C C C C C C C C C C H H H H H H H H H H H H H H
charge: -0.255455 -0.630811 -0.613655 -0.046625 0.401510 0.337888 0.129925 -0.393525 -0.380855 -0.364915 -0.415861 -0.246004 -0.235214 -0.230624 -0.223898 -0.243642 -0.243891 0.305169 0.272086 0.249050 0.257259 0.265594 0.271243 0.223357 0.228917 0.222440 0.227026 0.225903 0.230328 0.349000 0.328279
chargesum: 0.00000
title: Mulliken charges with hydrogens summed into heavy atoms:
elementType: O N N C C C C C C C C C C C C C C
charge: -0.255455 -0.053556 0.063623 -0.046625 0.401510 0.337888 0.129925 -0.144475 -0.123596 -0.099321 -0.144618 -0.022647 -0.006297 -0.008184 0.003127 -0.017740 -0.013562
polarizability: 1.91033886e+02 -4.65993117e+00 1.41992464e+02 9.53607069e+00 -7.96074645e+00 1.47317537e+02
1716.lowfreq: -10.8083 0.0005 0.0007 0.0008 1.7356 7.5355 19.9229 43.0941 54.5158
frequency: 19.8416 43.0597 54.5063 66.6039 119.9532 157.2752 197.8273 252.7828 265.1558 277.9861 317.0070 323.0258 361.7727 376.7327 405.8224 406.4618 445.3508 485.8655 541.5436 558.7850 581.3153 614.9585 615.4902 620.1732 638.6232 682.2412 702.0733 709.4909 734.5014 753.8587 762.2974 781.5531 851.7923 861.3228 864.5193 915.3979 925.5953 953.5618 976.8582 984.0199 989.2311 991.6098 994.8055 999.7853 1026.0005 1027.4408 1058.5596 1063.3722 1081.9305 1104.9186 1130.9579 1171.1135 1172.6603 1190.2739 1193.2891 1206.0809 1281.8679 1310.6223 1318.7101 1323.4742 1377.7169 1380.0816 1431.8711 1435.1504 1478.0038 1481.3017 1569.4107 1588.0405 1591.0082 1606.8886 1610.6198 1626.4786 1645.0040 3121.3482 3122.0392 3129.3695 3132.7972 3141.9613 3147.9931 3156.3310 3157.0633 3166.4241 3167.0977 3414.0308 3498.2167 3540.1144 3652.2717
redmass: 4.4082 4.0584 5.0134 4.3832 5.0169 5.8591 4.1080 4.6100 3.8241 3.4518 2.3907 5.1607 3.6895 1.7319 2.8197 2.5718 4.1399 3.4332 3.0497 1.1929 2.9450 4.1148 5.9897 1.6753 3.8305 4.8884 1.8102 1.7680 4.9080 1.6861 1.7916 1.8179 1.2508 1.3790 2.4872 1.9128 1.4472 2.8014 1.4088 1.4273 4.6047 4.8767 1.3637 1.3763 2.5446 2.2878 2.1932 2.0060 1.5943 1.9732 1.9607 1.0573 1.0513 1.1359 1.1236 3.7526 2.1812 3.4439 1.4072 1.3435 8.0797 8.6041 2.2082 2.2446 2.1937 2.2131 1.6875 5.1396 6.0762 5.9208 5.3538 3.0776 1.1115 1.0855 1.0846 1.0876 1.0886 1.0932 1.0929 1.0950 1.0953 1.1004 1.0998 1.0455 1.0444 1.0958 1.1045
irintensity: 4.5222 0.8844 3.0133 0.5321 2.1848 1.6114 2.1968 5.0260 0.9578 11.9409 12.0322 3.9813 16.9496 42.0155 2.6018 5.0350 7.3099 0.3139 13.7825 125.7649 14.6446 11.4976 1.2626 80.8424 20.4046 2.9118 51.7946 59.3182 17.0456 136.8252 17.0995 77.7755 0.7343 2.5877 2.4744 15.1252 1.9220 7.8232 0.4211 1.6591 0.5479 0.4856 0.3842 0.5765 8.9213 12.4713 2.1349 7.0910 0.6153 10.4146 0.4137 0.5168 0.2731 2.9325 3.4539 23.7865 30.4635 88.3133 14.7659 3.0739 0.6016 0.2615 3.5958 18.7249 32.4983 9.7979 121.5946 3.7269 1.9867 30.8433 2.8771 230.1051 78.7398 3.2121 0.2455 2.4087 12.5980 22.3416 26.6752 15.6226 24.4896 17.8467 17.8754 6.6322 29.7680 2.4955 54.5778
temp: 298.150 k
press: 1.00000 atm
elementType: 8 7 7 6 6 6 6 6 6 6 6 6 6 6 6 6 6 1 1 1 1 1 1 1 1 1 1 1 1 1 1
symmnumber: 1
zpe: 653234.9 jmol-1
zpe.correction: 0.248804 hartree
zpe.thermalcorrener: 0.263687 hartree
zpe.thermalcorrenthalpy: 0.264631 hartree
zpe.thermalcorrgfe: 0.205763 hartree
zpe.sumelectzpe: -725.419718 hartree
zpe.sumelectthermal: -725.404835 hartree
zpe.sumelectthermalent: -725.403891 hartree
zpe.sumelectthermalfe: -725.462759 hartree
dipole: 3.5059 -0.5791 -0.7624
dipole: 3.6343
quadrupole: -92.3668 -100.8146 -90.5102
quadrupole: 9.2315 0.6948 -1.3544
quadrupole: 2.1971 -6.2507 4.0536 9.2315 0.6948 -1.3544
hfenergy: -725.6685217 hartree
pointgroup: C01 [X(C14H14N2O1)]
dipole: 1.3945476 -0.3002011 -0.0976525 debye
polarizability: 187.3883951|-4.7251431|141.2455882|14.8029002|-8.5669419|151.7099042 unknown
InChI: InChI=1S/C14H14N2O/c15-13(17)14(16,11-7-3-1-4-8-11)12-9-5-2-6-10-12/h1-10H,15-16H2
charge 0 multiplicity 1
31 atoms
O  -0.858516 3.077281 -0.346474
N  -0.19996 1.311587 1.980041
N  1.378392 2.601296 -0.709406
C  -0.02293 0.921656 0.55344
C  -1.27752 0.134052 0.107002
C  1.208919 -0.000219 0.396902
C  0.117701 2.2739 -0.249205
C  -1.900168 0.327179 -1.149491
C  1.574274 -0.47539 -0.892496
C  -1.772697 -0.873755 0.973152
C  1.973934 -0.41594 1.514013
C  -2.997198 -0.477497 -1.534112
C  2.688689 -1.324205 -1.060638
C  -2.870872 -1.673241 0.591231
C  3.091852 -1.266584 1.346321
C  -3.486558 -1.480808 -0.667791
C  3.458933 -1.718985 0.059563
H  -1.08682 1.816206 2.107133
H  0.588802 1.864834 2.341179
H  -1.559151 1.124344 -1.81732
H  0.967595 -0.201362 -1.763741
H  -1.28956 -1.014995 1.945485
H  1.667332 -0.101457 2.516017
H  -3.47563 -0.311971 -2.506154
H  2.950499 -1.685366 -2.061644
H  -3.243744 -2.447291 1.27183
H  3.669782 -1.580901 2.222955
H  -4.339053 -2.101131 -0.967274
H  4.323241 -2.37996 -0.069268
H  2.150153 1.935676 -0.67472
H  1.515076 3.519945 -1.131732
