program: Gaussian 09
title: 000257138
version: EM64L-G09RevD.01
frameworkgroup: C1[X(C17H12N2O3)]
method: RPBEPBE
basis: SDD
operation: Freq
keyword: #p
keyword: freq=noraman
keyword: PBEPBE/SDD
title: #p freq=noraman PBEPBE/SDD
converged: YES YES NO NO
title: Mulliken charges:
elementType: O O O N N C C C C C C C C C C C C C C C C C H H H H H H H H H H H H
charge: -0.225425 -0.214166 -0.273366 -0.361207 -0.394120 0.049800 0.511097 0.116073 0.160166 0.140807 -0.218177 0.404632 -0.336825 -0.329987 -0.216548 -0.216512 -0.382535 -0.354318 -0.234335 -0.243020 -0.245455 -0.218331 0.252111 0.365889 0.247157 0.245561 0.229709 0.230020 0.238618 0.330824 0.231051 0.237232 0.236555 0.237025
chargesum: 0.00000
title: Mulliken charges with hydrogens summed into heavy atoms:
elementType: O O O N N C C C C C C C C C C C C C C C C C
charge: -0.225425 -0.214166 -0.273366 -0.361207 -0.028232 0.049800 0.511097 0.116073 0.160166 0.140807 0.033934 0.404632 -0.089668 -0.084426 0.013161 0.013509 -0.143918 -0.023494 -0.003284 -0.005788 -0.008901 0.018695
polarizability: 3.95256717e+02 -1.56569268e+01 1.97496918e+02 -3.92713142e+00 7.58381984e+00 1.10333054e+02
1716.lowfreq: -7.7434 -0.0008 0.0003 0.0004 1.9731 5.8700 23.4603 31.2676 36.0120
frequency: 23.3593 31.2296 35.9799 61.6981 63.3982 102.0706 131.2182 145.5830 158.0417 197.2002 251.3572 253.1427 262.7444 282.8323 370.4985 391.2663 406.2116 408.8390 416.7001 440.4730 495.0455 505.7985 516.7668 539.7582 591.8900 609.1754 613.0312 617.5879 654.6068 689.0840 695.8485 698.8355 711.9940 742.1511 750.7953 776.7825 781.3884 781.9765 790.8666 839.2948 864.1732 899.4152 918.7969 952.5624 969.9740 987.5918 991.6887 994.2371 997.7388 1015.6209 1016.8234 1029.5129 1033.3374 1041.7321 1074.4780 1086.0017 1101.5972 1164.0268 1173.2347 1176.2992 1183.6147 1202.4434 1212.0002 1233.7108 1297.2413 1316.8574 1343.4725 1355.2185 1372.2488 1385.7283 1385.9194 1425.1076 1440.3134 1448.9520 1480.0419 1481.2757 1547.4437 1564.2465 1584.4073 1603.5918 1608.5455 1610.3260 1631.3964 1656.2522 3063.7633 3125.7790 3132.0824 3134.8880 3143.6168 3150.2993 3155.7493 3163.9152 3165.9718 3171.1532 3174.8478 3525.6954
redmass: 6.0951 4.3418 5.5250 6.5673 5.6319 5.6584 6.1776 6.7762 8.8439 6.0956 6.8999 5.2650 7.0155 6.1645 3.7444 12.1070 2.8058 3.2064 13.6642 6.2368 5.5295 2.9237 4.8978 7.9176 6.6322 11.0135 6.4580 6.7053 3.1609 3.6340 1.8000 2.1675 5.7239 3.3922 2.0300 2.7858 2.0580 3.5408 4.5179 1.2538 1.2479 3.7987 1.6596 1.3557 1.3998 6.2195 6.1364 1.3273 1.3762 3.4550 1.4876 2.1668 1.3378 2.4204 2.5110 1.7776 2.4919 4.9379 1.0524 1.1120 1.1251 1.3932 2.1914 4.0622 2.5296 1.3270 1.5550 6.4302 1.9290 6.6070 7.3569 2.2656 2.2461 1.9832 2.0602 2.3580 9.3374 6.0346 7.3694 6.5571 6.1525 6.1598 5.3261 7.9489 1.0854 1.0874 1.0852 1.0883 1.0890 1.0932 1.0934 1.0967 1.0970 1.1005 1.1012 1.0768
irintensity: 1.0841 0.1549 0.2712 0.1576 1.3437 0.1495 0.1985 1.4160 6.7372 0.6975 6.3711 1.4051 10.8311 5.3504 0.8235 17.5478 0.1911 0.0284 1.2093 0.1894 8.8079 16.2106 40.6820 80.5425 6.5717 1.0923 0.3332 2.3904 12.3724 2.2927 41.3618 60.7927 6.4734 13.9994 57.0269 6.6312 45.0354 20.2623 79.0557 0.0676 0.6333 12.2777 6.0371 1.2699 0.2419 1.4324 4.1276 0.2388 2.4284 10.1115 7.7988 2.7139 3.9925 5.4484 11.1278 18.5400 8.2281 127.8359 0.0798 4.4362 7.7839 158.3933 43.7823 27.8884 187.0619 4.0365 32.0113 589.5252 3.9547 5.9726 7.7073 85.9886 9.0944 184.5979 13.3043 37.1080 317.7577 129.6826 338.9814 13.0772 25.6771 47.9118 545.3755 193.9295 1.3425 2.0326 0.0547 2.8387 7.3306 25.3933 35.6764 0.1842 17.4901 83.1900 6.7252 81.0801
temp: 298.150 k
press: 1.00000 atm
elementType: 8 8 8 7 7 6 6 6 6 6 6 6 6 6 6 6 6 6 6 6 6 6 1 1 1 1 1 1 1 1 1 1 1 1
symmnumber: 1
zpe: 662752.0 jmol-1
zpe.correction: 0.252429 hartree
zpe.thermalcorrener: 0.270013 hartree
zpe.thermalcorrenthalpy: 0.270958 hartree
zpe.thermalcorrgfe: 0.204652 hartree
zpe.sumelectzpe: -988.709483 hartree
zpe.sumelectthermal: -988.691899 hartree
zpe.sumelectthermalent: -988.690955 hartree
zpe.sumelectthermalfe: -988.757260 hartree
dipole: 2.6661 -1.8817 0.1615
dipole: 3.2672
quadrupole: -100.3003 -128.6274 -123.9488
quadrupole: 1.2560 -1.5453 3.8942
quadrupole: 17.3252 -11.0019 -6.3233 1.2560 -1.5453 3.8942
hfenergy: -988.9619123 hartree
pointgroup: C01 [X(C17H12N2O3)]
dipole: 1.0381793 -0.7503007 -0.1074767 debye
polarizability: 394.8072694|-17.3547803|189.953386|-6.7840527|26.3808385|118.3260334 unknown
InChI: InChI=1S/C17H12N2O3/c20-15-14(11-12-7-3-1-4-8-12)16(21)19(17(22)18-15)13-9-5-2-6-10-13/h1-11,18H
charge 0 multiplicity 1
34 atoms
O  -0.752937 -1.54404 -0.276507
O  -2.720223 2.647465 0.458635
O  1.885114 2.493571 0.43089
N  -1.757341 0.52486 0.084374
N  -0.408391 2.452019 0.42781
C  0.752031 0.339825 0.064399
C  -3.07901 -0.088755 -0.028801
C  -0.604864 -0.308886 -0.058446
C  -1.704544 1.919683 0.332093
C  0.833707 1.794809 0.313007
C  1.809338 -0.55531 -0.075612
C  3.267063 -0.515906 -0.050861
C  -3.478848 -0.65728 -1.256541
C  -3.936732 -0.102628 1.091144
C  -4.755391 -1.250471 -1.361413
C  -5.214761 -0.691593 0.97709
C  3.908071 -1.784944 -0.256104
C  4.097443 0.632466 0.152267
C  -5.625728 -1.267239 -0.247063
C  5.308096 -1.906245 -0.258974
C  5.499558 0.502214 0.148534
C  6.111888 -0.75784 -0.055589
H  1.419205 -1.571934 -0.25212
H  -0.366479 3.461401 0.601338
H  -2.796566 -0.646833 -2.111756
H  -3.613622 0.350429 2.033391
H  -5.068716 -1.696762 -2.311176
H  -5.886448 -0.699775 1.842039
H  3.28661 -2.675202 -0.41282
H  3.621805 1.603437 0.307888
H  -6.617256 -1.725229 -0.332242
H  5.773856 -2.884405 -0.417714
H  6.121215 1.390277 0.305574
H  7.204252 -0.845376 -0.056733
