program: Gaussian 09
title: 000257136
version: EM64L-G09RevD.01
frameworkgroup: C1[X(C16H21N3O2)]
method: RPBEPBE
basis: SDD
operation: Freq
keyword: #p
keyword: freq=noraman
keyword: PBEPBE/SDD
title: #p freq=noraman PBEPBE/SDD
converged: YES YES NO NO
title: Mulliken charges:
elementType: O O N N N C C C C C C C C C C C C C C C C H H H H H H H H H H H H H H H H H H H H H
charge: -0.222150 -0.190910 -0.428061 -0.043076 -0.452549 0.080213 -0.434561 -0.412904 -0.372741 0.129264 -0.015228 -0.357694 -0.733967 0.194574 -0.698426 0.449693 -0.446551 -0.312371 -0.198344 -0.221431 -0.249407 0.210412 0.247419 0.228599 0.222968 0.227992 0.209523 0.193352 0.199311 0.225137 0.244780 0.215590 0.320055 0.212836 0.212856 0.217164 0.302027 0.216135 0.335372 0.229802 0.232691 0.232606
chargesum: 0.00000
title: Mulliken charges with hydrogens summed into heavy atoms:
elementType: O O N N N C C C C C C C C C C C C C C C C
charge: -0.222150 -0.190910 -0.108006 -0.043076 -0.150522 0.080213 0.023269 0.038663 0.064774 0.129264 -0.015228 0.034969 -0.048459 0.194574 -0.055571 0.449693 -0.230416 0.023001 0.031458 0.011260 -0.016801
polarizability: 3.06814593e+02 -2.90586158e+01 1.58350681e+02 7.47069781e+00 2.26524104e+01 1.80400761e+02
1716.lowfreq: -11.9886 -1.9121 -0.0003 0.0005 0.0006 5.2738 15.2663 36.4519 49.1464
frequency: 13.8894 36.3416 49.1201 52.6113 63.7493 85.2709 92.7323 110.0951 129.4170 138.4115 156.0495 173.8130 192.4959 208.3223 218.8223 240.0053 252.3186 262.6832 282.3085 290.0209 308.2757 378.3550 408.1155 409.2218 475.1034 480.4920 490.4968 500.4831 546.6952 564.1950 610.5961 624.2097 639.5557 668.4059 681.2216 696.7764 708.6242 731.7963 744.0917 752.5769 768.9317 781.9180 788.8311 834.5618 844.4970 888.0568 902.5705 921.2133 924.7527 955.0587 976.5553 980.9902 984.9023 1001.1184 1012.7553 1027.7076 1036.7557 1067.7136 1069.2485 1085.8252 1096.2708 1102.6099 1141.9980 1158.5728 1173.2106 1178.8385 1187.9271 1204.3656 1217.8124 1250.0968 1264.6369 1281.7098 1293.2623 1296.4430 1314.2587 1323.6687 1329.7868 1340.3744 1355.0774 1384.1470 1389.5479 1391.4564 1409.5252 1442.7569 1447.5237 1461.5256 1469.8343 1476.0383 1479.4805 1481.4366 1484.0686 1488.1445 1490.4985 1539.1496 1560.0785 1606.1726 1612.7571 1633.4024 1640.5578 2963.4314 2969.8754 2974.5872 2985.4549 2989.9092 3007.4422 3015.5870 3025.6750 3055.8408 3068.2244 3072.3406 3073.8834 3079.0694 3096.2744 3104.4163 3136.0332 3148.5147 3167.9588 3187.0814 3490.6693 3524.8213
redmass: 4.8431 3.8905 2.3506 2.2299 4.6414 3.6995 4.3754 2.2196 2.8295 5.7387 6.4281 2.9889 2.4850 2.7118 1.3258 1.5961 4.4222 4.0186 4.3003 3.6925 2.3383 5.6461 2.9367 3.0660 2.9184 3.1210 7.5192 3.3599 2.4222 3.6744 6.5912 6.4523 1.4804 3.8357 7.8040 2.0249 4.3252 1.2131 2.3311 2.6719 1.6829 2.0282 1.5849 4.1871 1.2768 1.8015 1.6306 2.7221 1.4138 1.6058 1.3478 4.4150 5.8856 3.8586 1.3061 2.1225 3.5569 2.2307 1.6051 1.6276 2.6208 2.2100 2.8915 3.2984 1.0745 2.5898 1.1739 2.7500 1.5876 2.1502 1.2915 1.2173 1.5826 1.3071 1.5394 1.4178 1.3623 1.4168 1.4867 3.9012 1.2338 1.2136 2.5526 2.4634 1.0858 1.0870 1.0651 1.0430 1.0637 1.0500 2.3328 1.0530 1.0898 2.7415 5.4813 4.4696 5.6335 4.5087 9.7362 1.0590 1.0590 1.0366 1.0358 1.0591 1.0993 1.0602 1.1015 1.1038 1.1001 1.1009 1.0995 1.0991 1.1022 1.0892 1.0867 1.0931 1.0995 1.0962 1.0771 1.0758
irintensity: 0.9576 0.3878 0.2416 0.6855 1.4180 0.6457 1.2811 0.7902 0.2445 6.7440 2.5800 2.2267 4.5641 1.1651 0.6619 0.2661 2.2666 1.1764 0.3963 2.4263 3.7055 9.5931 0.0021 1.6693 7.1248 7.7943 5.4998 14.2473 8.1478 2.8288 0.8269 10.3240 96.6643 7.3079 13.7069 59.5440 4.7800 9.1275 16.3815 12.5983 98.4123 3.6204 5.0284 0.1157 0.1671 1.4958 1.5265 17.7026 13.3816 12.7838 0.1902 28.2417 0.5547 16.8994 3.5197 19.7691 5.1374 5.1376 1.9940 19.7082 29.8366 5.7658 32.2989 27.0696 2.1911 80.5555 0.3310 8.1168 134.4849 229.4826 4.9933 5.4388 40.5984 16.8112 41.4763 24.6586 3.5642 31.4515 6.8383 32.9133 18.9808 11.9669 51.7235 79.0757 35.2286 2.6698 2.1656 12.0397 1.3583 11.3517 76.1501 24.0236 16.7860 745.8819 542.5095 158.8635 60.4992 332.0279 55.0861 17.6114 21.0858 36.4329 34.4217 33.4473 9.5090 19.3730 0.8972 19.1801 4.4062 87.7321 52.2322 39.3600 26.6465 16.0573 0.4539 25.5969 21.1943 25.3608 17.7403 37.4423
temp: 298.150 k
press: 1.00000 atm
elementType: 8 8 7 7 7 6 6 6 6 6 6 6 6 6 6 6 6 6 6 6 6 1 1 1 1 1 1 1 1 1 1 1 1 1 1 1 1 1 1 1 1 1
symmnumber: 1
zpe: 908311.6 jmol-1
zpe.correction: 0.345958 hartree
zpe.thermalcorrener: 0.367053 hartree
zpe.thermalcorrenthalpy: 0.367998 hartree
zpe.thermalcorrgfe: 0.294352 hartree
zpe.sumelectzpe: -935.468056 hartree
zpe.sumelectthermal: -935.446961 hartree
zpe.sumelectthermalent: -935.446016 hartree
zpe.sumelectthermalfe: -935.519662 hartree
dipole: -2.6847 3.8303 3.2550
dipole: 5.6986
quadrupole: -114.0258 -130.7762 -126.4431
quadrupole: -2.7143 -11.0338 -0.0234
quadrupole: 9.7226 -7.0278 -2.6948 -2.7143 -11.0338 -0.0234
hfenergy: -935.814014 hartree
pointgroup: C01 [X(C16H21N3O2)]
dipole: 1.1303085 -0.908487 1.7098578 debye
polarizability: 309.5053851|-21.7096995|143.5901921|1.8583579|-9.3575261|192.4704574 unknown
InChI: InChI=1S/C16H21N3O2/c1-3-5-11-16(4-2)13(20)18-15(19-14(16)21)17-12-9-7-6-8-10-12/h6-10,17-18H,3-5,11H2,1-2H3
charge 0 multiplicity 1
42 atoms
O  -2.516256 1.109705 1.966346
O  -0.925288 1.07742 -2.53938
N  -0.331232 0.590317 1.437104
N  0.509882 0.462101 -0.821452
N  1.917278 0.061122 1.047689
C  -2.013134 0.568477 -0.40139
C  -2.391854 -0.966377 -0.567646
C  -3.188602 1.482264 -0.840095
C  -3.658889 -1.434704 0.180182
C  -1.681326 0.799462 1.07577
C  -0.77262 0.760467 -1.33024
C  -3.843684 -2.967248 0.070366
C  -2.86786 2.991007 -0.792016
C  0.693124 0.369388 0.485337
C  -5.131125 -3.460223 0.765016
C  3.183332 -0.152385 0.418846
C  4.276231 -0.431708 1.28411
C  3.385344 -0.099422 -0.984805
C  5.561437 -0.65679 0.753005
C  4.681003 -0.324105 -1.498361
C  5.772352 -0.60363 -0.644789
H  -1.530635 -1.588561 -0.248526
H  -2.520754 -1.13516 -1.655048
H  -4.051301 1.273676 -0.183772
H  -3.46142 1.194569 -1.87156
H  -3.610604 -1.144811 1.247728
H  -4.553796 -0.936891 -0.239639
H  -2.963639 -3.475819 0.515262
H  -3.864087 -3.260018 -0.999313
H  -2.616334 3.315961 0.234239
H  -2.030928 3.243202 -1.465964
H  -3.746831 3.576628 -1.116657
H  -0.122377 0.716373 2.433308
H  -6.027603 -2.994463 0.314296
H  -5.125495 -3.20211 1.840722
H  -5.241288 -4.556869 0.679992
H  1.935278 -0.043319 2.065028
H  4.122547 -0.471123 2.371271
H  2.535881 0.113421 -1.635978
H  6.395341 -0.871566 1.429894
H  4.832711 -0.280797 -2.582455
H  6.770817 -0.777861 -1.059127
