program: Gaussian 09
title: 000257125
version: EM64L-G09RevD.01
frameworkgroup: C1[X(C11H19N3O3)]
method: RPBEPBE
basis: SDD
operation: Freq
keyword: #p
keyword: freq=noraman
keyword: PBEPBE/SDD
title: #p freq=noraman PBEPBE/SDD
converged: YES YES NO NO
title: Mulliken charges:
elementType: O O O N N N C C C C C C C C C C C H H H H H H H H H H H H H H H H H H H
charge: -0.213943 -0.204330 -0.432032 -0.390748 -0.021076 -0.610990 0.058759 -0.459366 -0.392555 -0.446919 -0.020162 0.149371 -0.001384 -0.353887 -0.715374 -0.723258 0.168573 0.237858 0.205721 0.203857 0.219128 0.226787 0.237638 0.193652 0.205696 0.259096 0.218358 0.215243 0.206726 0.209145 0.211871 0.212828 0.326413 0.332702 0.363115 0.323489
chargesum: 0.00000
title: Mulliken charges with hydrogens summed into heavy atoms:
elementType: O O O N N N C C C C C C C C C C C
charge: -0.213943 -0.204330 -0.099330 -0.064335 -0.021076 0.075613 0.058759 -0.015787 0.030429 0.017506 0.173490 0.149371 -0.001384 0.110906 -0.075048 -0.089415 0.168573
polarizability: 1.65711625e+02 1.97072237e+01 1.52293466e+02 2.25664432e+00 -6.16827411e+00 1.36458791e+02
1716.lowfreq: -5.9013 -0.4015 0.0005 0.0007 0.0009 11.5380 23.1117 30.5581 51.8192
frequency: 22.9829 30.5196 51.7956 57.9674 68.3534 105.3933 123.3551 131.2566 135.6008 170.0586 192.3474 210.7676 234.7716 237.0527 244.5614 280.1380 300.8366 324.4997 328.7143 356.8196 363.8028 379.0906 396.2900 432.9854 483.0252 497.6673 513.0451 572.2752 595.1933 627.6283 634.1892 697.6763 711.7677 737.0926 747.1117 760.4069 789.7826 820.3612 879.5078 914.9573 931.4408 951.7198 960.1174 962.7686 991.3594 996.7502 1009.7604 1038.7786 1051.0300 1072.7864 1105.8064 1133.7062 1149.6441 1177.2860 1188.5603 1204.2110 1238.2232 1265.0295 1273.2725 1289.3496 1301.7896 1310.0448 1319.1228 1323.5129 1335.6884 1342.9557 1357.7070 1376.7391 1380.6124 1394.5525 1442.3463 1455.7839 1461.1129 1461.8970 1468.5418 1472.7449 1478.8891 1482.2442 1490.1044 1561.8250 1600.5213 1638.9485 1654.6431 2952.6721 2965.7163 2969.4291 2973.5886 2975.5772 2993.7200 3002.9622 3027.7892 3041.4727 3059.9614 3064.8876 3069.3452 3072.6253 3085.2048 3110.6992 3502.1203 3541.2898 3555.9738 3692.8356
redmass: 5.1872 2.6251 3.9106 4.5967 2.0348 6.0815 3.7774 2.7686 6.4763 5.4996 3.0376 1.1383 1.7832 3.3154 1.5620 2.5940 2.2804 2.7412 1.5723 1.4969 2.5000 2.6767 2.9250 2.5026 7.0776 5.2446 4.2519 1.1821 4.1529 5.3256 1.5322 6.7473 3.5841 4.4612 1.6787 3.9390 1.2336 2.7022 2.0195 1.1817 2.1569 1.6352 2.8707 2.9877 2.3889 2.9726 2.0850 2.6776 2.0698 3.0444 1.8792 2.1669 2.1746 1.8061 2.0853 3.9523 1.4521 2.5919 1.3458 1.4450 1.3164 1.2664 1.6335 1.3632 1.3799 1.2644 1.4592 1.2161 1.2141 1.2145 1.0812 1.3161 1.6663 1.3488 1.0465 1.0638 1.0880 1.0556 1.0491 6.6848 1.6075 5.6436 3.5654 1.0823 1.0372 1.0539 1.0387 1.0592 1.0682 1.0648 1.0993 1.0998 1.0996 1.0999 1.0989 1.0986 1.0987 1.0985 1.0772 1.0457 1.0663 1.1052
irintensity: 7.3018 0.9404 1.1962 1.0217 7.2361 1.3509 0.3308 1.1670 4.9244 2.9035 2.4998 0.1089 5.3627 6.1642 0.3501 0.3562 19.1681 40.8980 110.1788 40.9135 18.1609 4.2057 1.0505 1.8179 3.4323 5.3313 11.3432 246.4784 3.7542 1.2130 62.8467 20.4214 10.8312 15.1537 17.0711 10.9842 10.1086 1.2591 2.3074 3.7073 8.2406 11.3117 12.6135 94.6250 6.9749 46.7849 20.0803 13.6152 10.5107 7.1527 27.3642 9.3252 22.7296 10.2767 12.4106 5.9560 10.2232 130.0894 39.0544 13.8283 13.0181 2.1442 99.6046 17.7437 14.9106 13.1011 5.9648 19.9845 12.3222 14.6910 17.5755 32.7239 102.9965 41.5566 2.7538 5.5709 4.9178 6.7586 24.7792 654.9669 85.6948 418.1902 223.1801 18.4728 27.5520 43.8399 18.8908 13.1483 38.3064 25.4548 11.8718 24.9597 17.2766 19.0067 96.9731 61.5506 18.2980 15.0294 22.1672 127.7603 9.6821 46.5412
temp: 298.150 k
press: 1.00000 atm
elementType: 8 8 8 7 7 7 6 6 6 6 6 6 6 6 6 6 6 1 1 1 1 1 1 1 1 1 1 1 1 1 1 1 1 1 1 1
symmnumber: 1
zpe: 783096.1 jmol-1
zpe.correction: 0.298266 hartree
zpe.thermalcorrener: 0.317349 hartree
zpe.thermalcorrenthalpy: 0.318293 hartree
zpe.thermalcorrgfe: 0.250002 hartree
zpe.sumelectzpe: -819.178927 hartree
zpe.sumelectthermal: -819.159843 hartree
zpe.sumelectthermalent: -819.158899 hartree
zpe.sumelectthermalfe: -819.227190 hartree
dipole: -3.1999 -4.1456 3.3918
dipole: 6.2394
quadrupole: -87.9494 -92.9924 -117.0265
quadrupole: 23.5044 -4.9121 7.3660
quadrupole: 11.3733 6.3304 -17.7037 23.5044 -4.9121 7.3660
hfenergy: -819.4771921 hartree
pointgroup: C01 [X(C11H19N3O3)]
dipole: 1.3320131 -1.6011569 -1.29917 debye
polarizability: 167.9439098|-18.6775847|150.5249015|2.1187635|6.0592405|135.9950709 unknown
InChI: InChI=1S/C11H19N3O3/c1-7(2)3-4-11(5-6-15)8(16)13-10(12)14-9(11)17/h7,13,15H,3-6,12H2,1-2H3
charge 0 multiplicity 1
36 atoms
O  0.217264 -1.023184 -2.363607
O  0.142544 0.605036 2.144609
O  1.818809 3.935133 -0.54411
N  1.821985 -1.611391 -0.808994
N  1.928152 -0.70053 1.429394
N  3.534103 -2.220508 0.701135
C  0.330464 0.31984 -0.284043
C  -1.198875 0.574749 -0.378398
C  -2.065826 -0.639158 0.025308
C  1.15009 1.5715 -0.808713
C  -3.58968 -0.406696 -0.162101
C  0.735975 -0.814695 -1.236387
C  0.768731 0.063289 1.194586
C  0.956277 2.871884 0.000436
C  -4.124046 0.731569 0.741131
C  -4.364185 -1.718677 0.108632
C  2.405516 -1.473342 0.464369
H  -1.433296 1.423861 0.284665
H  -1.434354 0.867176 -1.420149
H  -1.773808 -1.518126 -0.584172
H  -1.872991 -0.890275 1.087678
H  0.840804 1.740569 -1.860617
H  2.233809 1.343955 -0.814347
H  -3.761373 -0.119105 -1.222132
H  -0.104393 3.190689 0.007247
H  1.288165 2.750566 1.042199
H  -3.661812 1.706031 0.501117
H  -3.914255 0.512792 1.805829
H  -5.218323 0.843816 0.625234
H  -4.220599 -2.04653 1.156484
H  -5.449515 -1.584267 -0.056527
H  -4.016957 -2.534754 -0.55271
H  2.129082 -2.335579 -1.465963
H  1.503025 4.173869 -1.452577
H  3.936053 -2.151153 1.634568
H  4.003441 -2.772749 -0.012373
