program: Gaussian 09
title: 000257118
version: EM64L-G09RevD.01
frameworkgroup: C1[X(C14H17N3O3)]
method: RPBEPBE
basis: SDD
operation: Freq
keyword: #p
keyword: freq=noraman
keyword: PBEPBE/SDD
title: #p freq=noraman PBEPBE/SDD
converged: YES YES NO NO
title: Mulliken charges:
elementType: O O O N N N C C C C C C C C C C C C C C H H H H H H H H H H H H H H H H H
charge: -0.220217 -0.187694 -0.430275 -0.429407 -0.043706 -0.451468 0.062163 -0.442566 -0.404212 0.127043 -0.002426 -0.355270 -0.727875 0.198415 0.449991 -0.445376 -0.311692 -0.198190 -0.220447 -0.248201 0.204844 0.269481 0.223318 0.228996 0.224049 0.237027 0.223476 0.245744 0.218833 0.322362 0.302752 0.330615 0.216406 0.335131 0.230917 0.233785 0.233670
chargesum: 0.00000
title: Mulliken charges with hydrogens summed into heavy atoms:
elementType: O O O N N N C C C C C C C C C C C C C C
charge: -0.220217 -0.187694 -0.099659 -0.107045 -0.043706 -0.148717 0.062163 0.031759 0.048103 0.127043 -0.002426 0.105807 -0.039822 0.198415 0.449991 -0.228969 0.023440 0.032727 0.013338 -0.014531
polarizability: 2.93304187e+02 -1.57759657e+01 1.45392309e+02 -6.53448175e+00 -2.79685530e+01 1.53331574e+02
1716.lowfreq: -9.4814 -3.5088 0.0005 0.0005 0.0008 6.5423 15.2814 39.0895 54.2037
frequency: 14.5103 39.0179 54.1961 70.2669 80.3905 92.1231 115.5451 123.4084 135.8643 161.4865 184.8978 205.1408 219.5303 249.2679 263.0368 267.8314 290.0037 304.9488 314.7310 339.6636 379.9711 407.6660 478.4049 482.4919 492.1225 504.7016 549.3487 568.7314 609.9776 624.1438 643.3853 668.9633 681.5917 697.1191 708.3235 742.8039 756.7553 769.8978 782.0523 793.3234 835.5262 845.4034 912.7831 925.2940 926.2554 965.0412 978.1638 984.7479 989.7616 1000.0922 1013.7788 1025.7691 1027.1197 1054.5420 1085.7549 1094.4396 1100.3162 1139.3445 1165.6475 1173.8200 1186.1970 1188.3673 1204.8491 1247.9605 1269.7621 1294.2564 1302.0768 1315.1723 1324.6703 1334.5927 1347.9325 1384.1568 1387.2251 1391.7779 1408.5769 1442.4365 1447.1801 1459.8316 1482.8956 1483.4088 1484.6975 1488.7798 1540.2105 1560.5938 1606.6668 1612.0749 1633.9906 1640.1660 2970.5080 2986.9432 2991.7207 3015.9520 3051.0328 3068.7081 3081.3551 3096.9053 3103.1017 3105.8054 3136.7244 3149.0508 3168.6816 3188.1927 3489.1653 3524.1878 3556.2573
redmass: 5.8719 4.2225 5.4853 2.0223 3.9223 4.8940 2.8788 4.3449 5.7503 5.9894 4.4791 1.6290 4.0016 2.8163 3.5467 3.7804 4.4218 1.2545 2.4608 3.2380 5.9058 2.9370 6.9133 2.3141 5.1494 3.5704 2.7433 3.0165 6.5663 6.3402 1.5238 4.0371 6.7288 2.0379 4.0883 2.3022 3.6910 1.6736 2.4452 1.3743 4.3373 1.2776 2.9356 1.9652 1.4707 4.3652 1.3467 6.1281 5.5107 3.6274 1.3054 1.7131 2.1437 2.9828 1.6161 1.8461 2.0210 2.4737 3.0503 1.0977 2.1341 1.1885 2.6421 2.4105 1.2765 2.0483 1.1996 1.5441 1.4217 1.3457 1.3286 3.9717 1.2088 1.2229 2.5575 2.4372 1.0861 1.0866 1.0513 2.3338 1.0840 1.0505 2.6179 5.9996 4.4544 5.6178 4.3052 10.9119 1.0632 1.0359 1.0680 1.0597 1.0963 1.1004 1.0992 1.1022 1.0894 1.0983 1.0867 1.0931 1.0995 1.0961 1.0771 1.0758 1.0663
irintensity: 0.7752 0.2137 1.7976 3.7854 2.1269 1.2916 1.1430 2.3967 7.6524 1.1201 9.7045 0.1301 2.3753 1.7775 0.9709 9.1251 2.0826 108.7440 1.3552 49.2930 9.0789 0.0013 6.4307 5.0658 13.2961 10.9639 8.9285 1.7093 0.6696 9.1813 88.5443 8.5180 17.7735 62.6732 9.4161 14.0677 20.1435 102.2668 3.1693 5.1032 0.4381 0.2551 2.7539 19.3918 8.9115 108.5502 0.2215 3.5316 42.8923 10.2150 3.4837 12.7283 24.9847 12.2130 13.7534 22.3618 15.5747 22.3887 4.8252 0.7855 191.6008 2.4053 27.1887 235.0600 23.0896 65.5480 1.2061 66.1460 17.7669 17.7999 20.4651 30.3619 12.1351 17.7476 52.1611 72.4195 36.3503 5.9292 10.8885 73.9792 3.9176 29.4865 671.0371 589.5833 163.7841 50.4988 384.4062 32.4753 23.9280 27.7351 29.5784 20.5348 5.6267 4.1152 38.3465 24.9725 16.0808 26.2733 0.3011 24.3375 20.8532 23.5662 18.0745 39.3640 10.8275
temp: 298.150 k
press: 1.00000 atm
elementType: 8 8 8 7 7 7 6 6 6 6 6 6 6 6 6 6 6 6 6 6 1 1 1 1 1 1 1 1 1 1 1 1 1 1 1 1 1
symmnumber: 1
zpe: 773182.6 jmol-1
zpe.correction: 0.294490 hartree
zpe.thermalcorrener: 0.313884 hartree
zpe.thermalcorrenthalpy: 0.314828 hartree
zpe.thermalcorrgfe: 0.245402 hartree
zpe.sumelectzpe: -932.149215 hartree
zpe.sumelectthermal: -932.129820 hartree
zpe.sumelectthermalent: -932.128876 hartree
zpe.sumelectthermalfe: -932.198303 hartree
dipole: 5.0818 -3.4873 3.7316
dipole: 7.2049
quadrupole: -118.4691 -120.9045 -121.9495
quadrupole: -10.0723 1.7062 -2.9041
quadrupole: 1.9720 -0.4635 -1.5085 -10.0723 1.7062 -2.9041
hfenergy: -932.4437043 hartree
pointgroup: C01 [X(C14H17N3O3)]
dipole: 1.9922961 -0.8194423 1.8423875 debye
polarizability: 293.4095511|-16.4601797|129.0447374|-0.4052434|-19.8154298|169.5737815 unknown
InChI: InChI=1S/C14H17N3O3/c1-2-14(8-9-18)11(19)16-13(17-12(14)20)15-10-6-4-3-5-7-10/h3-7,15-16,18H,2,8-9H2,1H3
charge 0 multiplicity 1
37 atoms
O  -2.821394 0.153825 2.210717
O  -1.298764 1.434526 -2.14368
O  -4.027205 -3.160693 -0.804563
N  -0.609131 -0.011598 1.57694
N  0.203791 0.507396 -0.636124
N  1.666468 -0.247762 1.074118
C  -2.31626 0.321291 -0.211803
C  -2.617417 -1.123718 -0.789697
C  -3.545759 1.256154 -0.385329
C  -1.976438 0.167734 1.276321
C  -1.103558 0.830984 -1.056516
C  -3.853958 -1.830859 -0.195073
C  -3.296899 2.712192 0.061144
C  0.415407 0.099477 0.604075
C  2.936672 -0.193871 0.418948
C  4.059065 -0.59723 1.192436
C  3.113939 0.230368 -0.923416
C  5.350759 -0.576751 0.630786
C  4.416421 0.247767 -1.467824
C  5.537479 -0.152307 -0.705672
H  -1.726457 -1.77024 -0.644088
H  -2.762964 -1.014694 -1.880696
H  -4.384545 0.838743 0.199142
H  -3.82506 1.238097 -1.454136
H  -3.789772 -1.901196 0.909103
H  -4.780455 -1.29764 -0.455982
H  -3.035743 2.765601 1.134064
H  -2.491243 3.180487 -0.530178
H  -4.211659 3.314156 -0.084813
H  -0.394766 -0.13232 2.572767
H  1.708559 -0.604386 2.031962
H  -3.255436 -3.732481 -0.560724
H  3.923166 -0.924264 2.232526
H  2.242287 0.534177 -1.50545
H  6.208116 -0.889896 1.236127
H  4.550176 0.577692 -2.503806
H  6.54078 -0.135164 -1.143806
