program: Gaussian 09
title: 000257112
version: EM64L-G09RevD.01
frameworkgroup: C1[X(C10H19NO3S)]
method: RPBEPBE
basis: SDD
operation: Freq
keyword: #p
keyword: freq=noraman
keyword: PBEPBE/SDD
title: #p freq=noraman PBEPBE/SDD
converged: YES YES NO NO
title: Mulliken charges:
elementType: S O O O N C C C C C C C C C C H H H H H H H H H H H H H H H H H H H
charge: 0.135649 -0.424041 -0.217208 -0.282847 -0.571514 -0.148523 -0.378259 -0.354292 -0.521207 0.187304 -0.342124 -0.714754 -0.704075 0.241618 -0.678724 0.245739 0.223879 0.237598 0.221992 0.301823 0.228491 0.214271 0.243053 0.220135 0.221856 0.218989 0.219524 0.234121 0.218774 0.243088 0.214727 0.403719 0.334255 0.326961
chargesum: 0.00000
title: Mulliken charges with hydrogens summed into heavy atoms:
elementType: S O O O N C C C C C C C C C C
charge: 0.135649 -0.020321 -0.217208 -0.282847 0.089703 -0.148523 0.091358 0.105298 -0.219384 0.187304 0.100637 -0.029710 -0.031441 0.241618 -0.002134
polarizability: 1.68832041e+02 1.29214314e+00 1.35549299e+02 4.48874909e+00 5.05391901e-01 1.25431148e+02
1716.lowfreq: -17.7057 -13.9496 -0.0017 0.0014 0.0017 11.9157 17.8728 43.2582 56.2002
frequency: 6.8248 43.0072 56.0193 71.9526 91.6479 111.2059 120.2816 121.8636 155.3854 161.4487 163.8766 193.0504 222.5418 232.0530 244.4765 254.9042 268.6407 302.0416 321.2607 349.6895 375.1415 380.2982 416.8973 482.9549 512.6770 518.7449 552.1798 578.4067 602.6106 636.0981 677.7584 697.4147 737.1403 742.7607 766.4662 788.9952 817.8494 848.7919 909.9491 918.2115 941.5501 1026.1115 1034.5459 1042.9787 1050.2227 1062.1324 1076.2293 1091.3731 1095.3584 1105.8573 1160.8041 1198.8463 1204.4202 1233.1428 1273.1157 1277.1392 1292.2043 1306.8975 1318.5645 1327.7192 1347.1350 1356.4619 1388.1522 1395.5767 1396.7378 1456.3099 1465.4338 1468.0262 1474.1247 1480.9066 1481.1416 1483.7669 1486.9964 1492.8202 1571.2320 1625.6919 1640.4295 2984.7115 2987.2660 2988.2085 2989.4255 2990.8963 3010.1121 3044.7501 3056.0622 3064.6163 3080.9168 3081.9800 3083.5725 3085.9768 3087.3318 3093.3451 3094.7683 3487.4829 3504.7153 3646.0211
redmass: 5.5943 3.9036 5.4055 3.8878 2.6572 4.0136 2.4831 2.6439 4.2961 2.9655 2.8442 1.6282 1.5746 1.2748 2.2876 4.1890 2.4560 2.4784 2.0359 3.5972 4.2423 4.1615 7.6849 4.8826 2.4991 1.9238 2.3820 1.1896 1.2673 2.1535 4.2256 3.3322 2.0583 3.5069 1.9173 1.3295 1.7869 1.8713 2.1291 2.3660 1.7220 1.8825 2.1109 2.1971 2.4995 2.0167 2.0894 1.9291 1.7836 1.8089 1.9221 1.3610 2.5219 1.3659 1.1878 1.4038 1.2059 1.5708 1.5106 1.3941 1.5006 2.9636 1.2111 1.1979 1.1970 1.0638 1.0797 1.0742 1.0409 1.0519 1.0644 1.0455 1.0439 1.0602 1.6836 3.2701 5.5925 1.0404 1.0561 1.0386 1.0409 1.0567 1.0621 1.1007 1.0945 1.0995 1.0979 1.0927 1.0988 1.0957 1.0998 1.1013 1.0999 1.0460 1.0642 1.1023
irintensity: 8.8830 1.9257 5.9724 1.0461 8.1792 2.9839 0.2443 0.0723 0.7066 0.1599 2.1932 0.9868 2.4352 1.0132 1.8847 3.1692 6.4208 0.1109 0.5465 1.2310 4.8094 6.0227 3.6881 7.8334 4.2187 65.5992 50.5924 5.0250 201.7944 165.0490 24.4515 45.7817 28.3689 3.9701 4.7216 6.1078 15.5158 4.4516 18.2709 17.2129 16.5805 4.4446 13.3689 81.8485 34.5938 1.0189 25.6079 4.0937 26.8379 20.1828 14.8415 4.0164 19.8116 7.5478 7.9923 3.2381 7.4790 5.2891 19.2727 5.3343 0.4930 56.2006 26.0267 16.0145 11.5580 1.8022 34.9452 4.7926 12.7669 20.5243 4.5509 2.3228 10.2134 0.8669 79.8258 136.3766 318.6499 33.2140 4.9710 35.9218 42.0581 13.1846 12.7261 7.7149 2.4904 0.1794 41.0638 19.1747 33.3629 18.7041 33.2820 33.0637 39.1947 27.8240 48.5978 54.9579
temp: 298.150 k
press: 1.00000 atm
elementType: 16 8 8 8 7 6 6 6 6 6 6 6 6 6 6 1 1 1 1 1 1 1 1 1 1 1 1 1 1 1 1 1 1 1
symmnumber: 1
zpe: 741360.7 jmol-1
zpe.correction: 0.282369 hartree
zpe.thermalcorrener: 0.301203 hartree
zpe.thermalcorrenthalpy: 0.302147 hartree
zpe.thermalcorrgfe: 0.234064 hartree
zpe.sumelectzpe: -1069.766135 hartree
zpe.sumelectthermal: -1069.747301 hartree
zpe.sumelectthermalent: -1069.746357 hartree
zpe.sumelectthermalfe: -1069.814441 hartree
dipole: -0.7602 1.9540 -1.4635
dipole: 2.5569
quadrupole: -96.8792 -101.8807 -96.9869
quadrupole: 0.4236 -6.6333 4.1426
quadrupole: 1.7031 -3.2985 1.5954 0.4236 -6.6333 4.1426
hfenergy: -1070.0485046 hartree
pointgroup: C01 [X(C10H19N1O3S1)]
dipole: -0.1938362 -0.775092 0.611264 debye
polarizability: 168.5144429|2.6402998|135.7196709|-5.178616|-0.5187287|125.578374 unknown
InChI: InChI=1S/C10H19NO3S/c1-4-7(8(11)12)15-10(5-2,6-3)9(13)14/h7,13H,4-6,11H2,1-3H3
charge 0 multiplicity 1
34 atoms
S  0.190365 -0.831165 1.088163
O  -0.47246 0.922865 -1.80355
O  -1.287496 2.136827 -0.000566
O  2.321376 1.769636 -1.075315
N  1.930782 1.76972 1.217342
C  -1.40468 -0.345547 0.042374
C  -2.520582 -0.216823 1.109986
C  -1.658707 -1.42533 -1.039929
C  1.671432 -0.354311 -0.035004
C  -1.08307 1.031583 -0.551185
C  2.883175 -1.199886 0.444178
C  -3.910628 0.096947 0.51005
C  -2.016408 -2.819121 -0.48739
C  1.981811 1.155531 -0.014037
C  4.156189 -0.944682 -0.39427
H  -2.237574 0.589672 1.808877
H  -2.566494 -1.156346 1.691848
H  -0.768408 -1.494321 -1.688747
H  -2.475692 -1.06202 -1.696073
H  1.407567 -0.617084 -1.071551
H  2.598826 -2.266955 0.378901
H  3.088296 -0.9837 1.510883
H  -3.894034 1.043725 -0.058386
H  -4.267525 -0.707001 -0.158303
H  -4.650798 0.209328 1.322386
H  -2.104638 -3.541867 -1.31855
H  -2.978062 -2.818187 0.056615
H  -1.231588 -3.182615 0.199909
H  3.976256 -1.152603 -1.464369
H  4.495905 0.102212 -0.313161
H  4.974848 -1.600898 -0.047686
H  -0.05712 1.790432 -2.064392
H  2.116233 2.771267 1.2690
H  1.464402 1.303019 1.998051
