program: Gaussian 09
title: 000257110
version: EM64L-G09RevD.01
frameworkgroup: C1[X(C22H23NO8S3)]
method: RPBEPBE
basis: SDD
operation: Freq
keyword: #p
keyword: freq=noraman
keyword: PBEPBE/SDD
title: #p freq=noraman PBEPBE/SDD
converged: YES YES NO NO
title: Mulliken charges:
elementType: S S S O O O O O O O O N C C C C C C C C C C C C C C C C C C C C C C H H H H H H H H H H H H H H H H H H H H H H H
charge: 0.951806 1.000175 1.000277 -0.374378 -0.385768 -0.526369 -0.525772 -0.576095 -0.493586 -0.568239 -0.486909 -0.365690 -0.364997 -0.369991 -0.301667 -0.294029 0.008060 -0.268627 -0.244154 -0.206706 -0.202386 -0.009126 -0.032722 -0.216788 -0.257207 -0.243902 -0.253251 -0.263492 -0.201138 -0.203840 -0.216027 -0.219852 -0.213605 -0.216528 0.278965 0.254244 0.258004 0.252356 0.259408 0.258477 0.248026 0.286066 0.292631 0.278700 0.243722 0.243298 0.239397 0.290371 0.287761 0.335945 0.353944 0.245505 0.245851 0.252283 0.255668 0.240821 0.241080
chargesum: 0.00000
title: Mulliken charges with hydrogens summed into heavy atoms:
elementType: S S S O O O O O O O O N C C C C C C C C C C C C C C C C C C C C C C
charge: 0.951806 1.000175 1.000277 -0.374378 -0.385768 -0.526369 -0.525772 -0.576095 -0.493586 -0.568239 -0.486909 -0.365690 0.168212 0.140369 0.216217 0.240064 0.008060 0.024004 0.034546 0.037016 0.040912 -0.009126 -0.032722 0.022609 0.033164 0.043859 0.082695 0.090453 0.044366 0.042011 0.036257 0.035816 0.027216 0.024552
polarizability: 4.15606708e+02 2.23543392e+01 3.59525841e+02 2.10624133e+01 -1.87826365e+01 3.05446012e+02
1716.lowfreq: -22.1028 -1.8197 -0.0010 0.0015 0.0017 3.5515 6.8135 8.9986 15.5422
frequency: -19.9441 6.9691 15.1812 27.7994 34.2271 39.0963 46.0835 50.6950 53.8086 56.2452 61.4635 72.9712 76.4248 86.7760 90.8292 111.4617 138.9765 142.9449 145.8972 175.7272 183.2421 194.2072 200.7626 203.5399 206.6281 209.5564 232.3649 243.7972 245.0674 246.9641 252.1209 271.8354 289.0558 295.2439 320.5262 328.0779 346.0473 351.6852 374.4165 390.3474 400.0744 404.2361 404.5577 406.8718 430.3585 445.9234 452.6272 459.4947 465.4956 493.9930 500.5818 516.1687 530.2778 599.8976 600.1934 601.4603 613.3301 656.6793 657.0336 659.6025 688.7115 691.0821 691.3457 759.4028 761.1276 761.9102 762.6670 764.5633 795.0203 821.0233 824.5676 851.7002 856.0274 860.9375 896.5124 909.3648 913.7837 932.0582 936.0162 943.7154 949.1034 957.6487 963.3562 972.9020 974.6056 977.9290 984.9902 991.0396 995.5919 997.4640 1005.8703 1006.0295 1006.0870 1008.4226 1010.1998 1019.1561 1031.3884 1043.7808 1045.5277 1045.9712 1051.8228 1077.5867 1084.5403 1085.9158 1114.2966 1169.0430 1173.9128 1174.3703 1174.8618 1178.7908 1186.7988 1189.4999 1232.0553 1245.9812 1285.3120 1303.4188 1311.2078 1312.4116 1315.1052 1321.9379 1333.6129 1358.8309 1382.0734 1382.5468 1383.0346 1384.4487 1430.3268 1434.7779 1436.8522 1437.9087 1438.8324 1445.0050 1452.1980 1452.2895 1454.6667 1455.3240 1571.2323 1572.2925 1576.0417 1600.2799 1600.7399 1603.6903 2988.2033 2988.8952 2998.0027 3009.9924 3048.3254 3056.1926 3079.4301 3088.3985 3104.4521 3115.3097 3138.6016 3141.7609 3142.4466 3149.1574 3155.1692 3155.4831 3157.8528 3166.3328 3166.4889 3166.7606 3176.0640 3176.5491 3176.9132
redmass: 6.5821 6.2875 6.3725 4.6626 5.5243 5.9396 8.1122 4.2696 6.5080 4.5791 6.8808 8.0433 7.1634 5.4759 6.3986 6.5756 6.1463 6.9372 6.8034 3.5595 5.1504 5.2813 7.0622 5.6785 5.7022 4.1528 4.6611 7.1400 8.4478 8.7213 6.3939 5.4844 5.7825 4.9709 7.1776 7.2492 3.7330 8.8981 7.6516 8.3413 9.0157 2.8433 2.8958 2.9161 10.0323 5.3937 5.5708 5.9274 6.5475 4.4766 4.5809 6.8699 5.4887 6.4760 6.4708 6.4774 5.2586 7.1450 7.1952 7.0590 2.6700 2.5155 2.6338 1.2507 1.4062 1.3410 1.3611 1.3308 14.4890 16.3789 16.8174 1.2430 1.2363 1.2389 5.5963 6.8908 5.0262 10.8308 1.4243 1.3252 1.3338 15.7001 14.2685 6.6405 6.6663 5.5197 1.4191 1.3797 3.7235 1.3741 4.4244 1.3760 4.2189 4.0264 1.3553 1.3224 3.6125 2.0579 2.1639 2.0473 2.3117 1.5595 1.5872 1.5980 1.9708 1.9588 1.0575 1.0590 1.0613 1.1274 1.1211 1.1221 1.5688 1.2714 1.1642 1.3006 1.2083 1.2336 1.2714 1.1102 1.1981 1.2062 7.9765 8.3790 8.1526 1.2145 1.0742 1.7351 1.2668 2.2465 2.1751 1.0851 1.9731 1.9826 1.3736 1.4098 5.7283 5.6832 5.7657 6.8006 6.8020 6.8842 1.0594 1.0588 1.0612 1.0584 1.1031 1.1031 1.1042 1.1047 1.0945 1.0942 1.0859 1.0867 1.0868 1.0886 1.0906 1.0907 1.0927 1.0958 1.0959 1.0969 1.1016 1.1011 1.1012
irintensity: 1.5296 0.1876 3.2934 0.2052 0.3885 0.6694 6.6332 0.6989 0.0936 0.0300 2.4612 0.2979 2.1891 0.8041 0.1906 1.0151 2.0278 4.2136 0.4223 1.6657 0.3560 0.7084 1.1186 15.9704 0.2593 0.1159 2.0211 0.8129 10.2760 8.9240 7.1524 35.5892 19.2598 8.5995 0.9732 1.8640 4.5016 3.2001 11.2669 12.8456 46.3748 0.0374 0.1188 0.0358 14.8405 11.9263 4.2658 38.9492 155.4497 28.9729 34.0095 403.0636 13.5852 2.1079 1.6349 0.0630 62.0139 1.0867 20.7447 15.3104 19.7223 58.0672 8.9613 2.8894 67.8911 86.3643 7.7349 87.1621 58.4788 58.2231 96.0186 0.3470 0.3898 1.3054 124.8264 132.4706 13.4234 70.1124 4.6874 2.0343 7.6347 204.9562 39.6539 3.4297 1.3450 2.0645 0.1362 0.0197 18.0799 1.6937 0.7321 0.2507 0.6430 1.8425 0.1941 1.6263 5.9259 13.2064 25.3286 12.2634 1.0402 4.4815 1.9593 0.8883 2.1048 13.7205 0.3321 1.0372 1.3121 7.6152 2.5972 3.2385 40.3591 15.3773 3.6216 3.2773 6.0846 19.2211 2.1751 1.2324 8.1573 1.6748 5.2562 13.4666 5.0583 4.1663 0.8934 7.9308 16.9491 36.2246 10.1105 29.3159 10.4273 21.4611 21.7507 30.2196 2.0750 0.6189 6.8188 0.3059 0.1567 0.4968 9.1731 3.6557 8.9881 6.2026 13.5220 0.9060 1.0063 7.8730 91.7854 79.8021 0.9013 2.8682 3.0919 9.5036 5.1988 4.1475 1.7964 1.6194 1.5037 3.7272 27.5765 27.4310 24.7189
temp: 298.150 k
press: 1.00000 atm
elementType: 16 16 16 8 8 8 8 8 8 8 8 7 6 6 6 6 6 6 6 6 6 6 6 6 6 6 6 6 6 6 6 6 6 6 1 1 1 1 1 1 1 1 1 1 1 1 1 1 1 1 1 1 1 1 1 1 1
symmnumber: 1
zpe: 1084110.8 jmol-1
zpe.correction: 0.412916 hartree
zpe.thermalcorrener: 0.447191 hartree
zpe.thermalcorrenthalpy: 0.448135 hartree
zpe.thermalcorrgfe: 0.342873 hartree
zpe.sumelectzpe: -2699.823116 hartree
zpe.sumelectthermal: -2699.788841 hartree
zpe.sumelectthermalent: -2699.787897 hartree
zpe.sumelectthermalfe: -2699.893159 hartree
dipole: -1.1104 4.3571 4.8602
dipole: 6.6210
quadrupole: -166.1283 -220.4301 -232.8547
quadrupole: 17.4390 21.4515 16.8675
quadrupole: 40.3428 -13.9591 -26.3837 17.4390 21.4515 16.8675
hfenergy: -2700.2360319 hartree
pointgroup: C01 [X(C22H23N1O8S3)]
dipole: 0.8865744 1.589263 -1.863825 debye
polarizability: 400.9851293|-26.562628|363.8931398|41.1834466|10.0006569|315.7002919 unknown
InChI: InChI=1S/C22H23NO8S3/c24-32(25,20-10-4-1-5-11-20)23(16-18-30-33(26,27)21-12-6-2-7-13-21)17-19-31-34(28,29)22-14-8-3-9-15-22/h1-15H,16-19H2
charge 0 multiplicity 1
57 atoms
S  -3.682018 -1.525626 0.451315
S  2.395132 -2.664602 -0.643555
S  1.10446 2.221041 1.609248
O  0.911583 -3.330311 0.314201
O  -0.755887 2.206162 1.24741
O  -3.925338 -0.723978 1.856183
O  -3.700412 -3.152425 0.37519
O  2.070232 -1.117474 -1.038335
O  2.718842 -3.761105 -1.779517
O  1.569486 0.670183 1.808487
O  1.340145 3.305735 2.778748
N  -2.078403 -1.024827 -0.295916
C  -1.084285 -2.094492 -0.498734
C  -1.695673 0.389787 -0.12323
C  -0.079124 -2.286541 0.659517
C  -1.381144 0.869051 1.323198
C  -4.943241 -0.844518 -0.782952
C  -5.594212 0.356105 -0.459264
C  -5.197572 -1.591666 -1.944611
C  -6.5497 0.848814 -1.379595
C  -6.158026 -1.083122 -2.8486
C  3.732534 -2.707276 0.680312
C  1.784133 2.889111 -0.013637
C  -6.825383 0.134041 -2.568582
C  4.622601 -3.792906 0.648826
C  1.913092 4.284001 -0.121257
C  3.76992 -1.664203 1.621261
C  2.131996 1.970992 -1.017524
C  5.631703 -3.828002 1.638269
C  2.424919 4.792037 -1.337075
C  4.788326 -1.727844 2.601358
C  2.644536 2.508538 -2.222088
C  5.710548 -2.801473 2.609269
C  2.784401 3.907446 -2.381834
H  -1.627626 -3.041181 -0.667154
H  -0.5288 -1.844072 -1.423436
H  -0.794197 0.533499 -0.749142
H  -2.488427 1.034727 -0.547856
H  -0.568992 -2.693079 1.564463
H  0.437179 -1.342038 0.914978
H  -0.712217 0.161183 1.847699
H  -2.29542 0.992436 1.927724
H  -5.380941 0.864175 0.486816
H  -4.682079 -2.540316 -2.12464
H  -7.079236 1.781958 -1.161703
H  -6.386401 -1.638612 -3.763998
H  -7.569096 0.519715 -3.274169
H  4.534017 -4.567866 -0.119037
H  1.638618 4.939717 0.710816
H  3.052976 -0.83393 1.604962
H  2.042466 0.885715 -0.880605
H  6.348688 -4.6551 1.648513
H  2.541559 5.873207 -1.462829
H  4.851744 -0.937084 3.355533
H  2.934139 1.825474 -3.026821
H  6.493548 -2.838037 3.374206
H  3.181126 4.309556 -3.320206
