program: Gaussian 09
title: 000257104
version: EM64L-G09RevD.01
frameworkgroup: C1[X(C16H21NOS)]
method: RPBEPBE
basis: SDD
operation: Freq
keyword: #p
keyword: freq=noraman
keyword: PBEPBE/SDD
title: #p freq=noraman PBEPBE/SDD
converged: NO YES NO NO
title: Mulliken charges:
elementType: S O N C C C C C C C C C C C C C C C C H H H H H H H H H H H H H H H H H H H H H
charge: 0.248846 -0.247195 -0.425405 -0.268414 -0.326296 -0.393395 -0.368704 0.136940 -0.356672 -0.713151 0.478050 -0.709433 -0.698664 0.311851 -0.382814 -0.414818 -0.229202 -0.225052 -0.238246 0.229508 0.224382 0.240067 0.207017 0.219771 0.204158 0.196539 0.196648 0.253762 0.222925 0.211184 0.332264 0.254567 0.211769 0.212752 0.216582 0.245350 0.249631 0.229681 0.229907 0.233314
chargesum: 0.00000
title: Mulliken charges with hydrogens summed into heavy atoms:
elementType: S O N C C C C C C C C C C C C C C C C
charge: 0.248846 -0.247195 -0.093142 -0.268414 0.127594 0.053688 0.055225 0.136940 0.036515 -0.025280 0.478050 -0.454866 -0.057561 0.311851 -0.137464 -0.165188 0.000479 0.004855 -0.004932
polarizability: 2.78287484e+02 -2.41178947e+01 1.87018495e+02 8.44567134e+00 2.79117722e+01 1.55002503e+02
1716.lowfreq: -6.3136 -5.1029 -0.0025 -0.0022 -0.0020 4.8224 24.1775 44.1549 50.7586
frequency: 23.9790 43.8385 50.4446 63.6626 86.0365 91.2000 105.6109 117.6968 128.9441 176.9665 186.0079 196.9221 215.2905 227.3389 234.7490 265.1516 289.0586 292.9808 308.4720 344.8188 387.2690 403.7683 406.4274 434.2349 457.2220 514.5050 527.5605 591.8668 610.6390 625.9412 655.0421 674.8769 703.0365 723.5496 732.7889 748.8206 752.0617 767.6775 786.2609 805.1992 832.3995 855.4410 882.2051 899.1581 903.5271 926.6399 949.6687 979.2073 988.5193 997.7246 1005.1695 1025.6477 1041.3288 1053.5705 1064.0165 1072.9071 1085.9612 1094.8087 1107.1928 1141.4239 1174.3562 1175.4644 1192.8770 1220.1705 1234.4807 1259.9078 1272.9414 1278.5336 1292.2641 1296.3688 1319.3038 1327.3665 1331.6754 1339.7844 1353.2186 1377.9468 1391.6978 1397.7580 1421.5115 1438.2205 1448.1430 1461.2507 1467.6643 1476.4322 1477.1034 1478.4061 1484.4309 1488.1582 1489.8279 1578.8506 1597.9225 1610.7407 1621.3355 2963.7910 2973.7680 2975.9837 2984.0773 2988.2816 2991.6429 3005.4479 3026.9672 3051.8827 3052.8103 3071.1558 3072.6125 3080.6066 3100.6400 3123.9927 3130.1947 3142.2197 3151.8262 3167.8742 3195.4861 3499.7339
redmass: 4.2743 2.6984 1.8274 3.6771 4.2705 4.2683 4.7035 2.2399 2.8719 3.7956 3.0913 2.2907 2.4798 1.5153 1.6851 5.0452 3.5714 2.8472 3.1684 5.5535 5.2433 5.2231 2.8935 3.5205 4.8361 3.7677 3.8847 4.2794 5.5357 4.7930 5.2288 1.6987 1.9776 1.4608 1.3287 1.7099 2.0274 2.5267 1.2575 2.4837 1.7897 1.2502 2.1375 1.9004 3.1202 1.4326 1.4422 1.5356 4.2091 1.3209 3.9189 2.4702 3.5107 2.1292 1.5314 2.4561 1.5944 1.6527 2.5473 2.8518 1.2339 1.8163 1.1174 1.5926 1.6048 1.3535 1.6264 1.2112 1.1630 1.5370 1.3764 1.3934 1.5385 1.8154 1.5603 6.7751 1.2134 1.2094 2.2405 2.2665 1.0867 1.0794 1.0711 1.0437 1.0483 1.0607 2.4105 1.0847 1.0486 5.8462 5.8804 5.9930 6.4526 1.0587 1.0382 1.0579 1.0588 1.0520 1.0461 1.0992 1.1021 1.1022 1.1001 1.1008 1.0994 1.0987 1.1004 1.0858 1.0867 1.0918 1.0963 1.1016 1.0921 1.0755
irintensity: 0.1950 0.0707 0.0877 0.6373 0.3321 0.1471 0.2522 0.5789 0.9892 1.5884 1.1830 0.7107 1.4819 0.9925 0.0980 1.2074 0.8773 3.7447 1.2254 2.2047 1.1154 4.0948 0.7196 2.8768 4.3210 15.8426 5.0635 3.8278 1.5767 5.6027 12.1257 54.6139 29.6396 8.3965 2.3381 123.6366 3.6642 48.3705 0.7290 4.7548 11.7804 0.8871 0.0394 3.1655 11.1075 4.7935 17.5342 0.3116 0.0091 0.1707 2.4335 2.4333 6.5677 11.4895 11.4320 1.7119 7.0410 3.8677 10.2939 12.8841 2.2704 5.0216 0.5233 10.4133 8.9933 3.2039 47.1803 10.9617 1.9355 4.3414 1.9645 1.3125 24.9247 49.5801 10.0034 1.8730 12.1005 24.0396 19.6985 7.4551 18.4802 1.4270 1.2866 6.8826 20.8904 7.0194 19.3056 18.3202 11.5107 12.5697 337.0130 20.8029 3.6793 20.4938 29.0805 10.6440 45.2183 35.7092 21.2504 3.3531 2.7900 29.5887 5.0815 81.7997 48.6639 52.2056 18.3190 7.2941 0.3427 12.2248 31.3524 23.6426 8.1176 25.5057
temp: 298.150 k
press: 1.00000 atm
elementType: 16 8 7 6 6 6 6 6 6 6 6 6 6 6 6 6 6 6 6 1 1 1 1 1 1 1 1 1 1 1 1 1 1 1 1 1 1 1 1 1
symmnumber: 1
zpe: 874419.6 jmol-1
zpe.correction: 0.333049 hartree
zpe.thermalcorrener: 0.352735 hartree
zpe.thermalcorrenthalpy: 0.353680 hartree
zpe.thermalcorrgfe: 0.284091 hartree
zpe.sumelectzpe: -1148.926788 hartree
zpe.sumelectthermal: -1148.907101 hartree
zpe.sumelectthermalent: -1148.906157 hartree
zpe.sumelectthermalfe: -1148.975745 hartree
dipole: -2.1563 1.5498 -1.7620
dipole: 3.1869
quadrupole: -107.9047 -121.8700 -128.9884
quadrupole: 0.2081 -4.4356 4.1511
quadrupole: 11.6830 -2.2823 -9.4007 0.2081 -4.4356 4.1511
hfenergy: -1149.2598365 hartree
pointgroup: C01 [X(C16H21N1O1S1)]
dipole: 0.7674441 0.7437555 0.6556999 debye
polarizability: 271.4940605|34.7062679|190.1294143|10.5376024|-28.6310399|158.6850073 unknown
InChI: InChI=1S/C16H21NOS/c1-3-5-11-16(4-2)15(18)17-14(12-19-16)13-9-7-6-8-10-13/h6-10,12,17H,3-5,11H2,1-2H3
charge 0 multiplicity 1
40 atoms
S  -0.921894 -2.238608 1.366542
O  -1.707092 -0.908868 -2.261954
N  0.209459 -0.624221 -1.011895
C  -1.955102 -1.092585 0.185184
C  -2.147691 0.28039 0.894108
C  -3.303052 -1.807864 -0.07011
C  -2.93999 1.32955 0.074473
C  -1.156643 -0.90203 -1.119583
C  -2.982852 2.699977 0.789571
C  -3.220809 -3.240757 -0.636492
C  1.048359 -0.684989 0.135852
C  0.656568 -1.373555 1.253367
C  -3.786634 3.757214 0.002528
C  2.348499 0.028691 0.028224
C  3.50552 -0.459394 0.697561
C  2.46745 1.209623 -0.757425
C  4.73593 0.220791 0.59759
C  3.703681 1.88326 -0.864622
C  4.843394 1.394947 -0.186077
H  -1.155809 0.699718 1.153444
H  -2.6692 0.087133 1.852523
H  -3.863366 -1.181428 -0.787824
H  -3.869998 -1.804332 0.88196
H  -2.487239 1.45366 -0.929307
H  -3.976842 0.978346 -0.093511
H  -1.946372 3.062523 0.947282
H  -3.424357 2.57334 1.79932
H  -2.695851 -3.24718 -1.606647
H  -2.695744 -3.928874 0.049232
H  -4.23961 -3.636763 -0.800628
H  0.660321 -0.429236 -1.912119
H  1.270733 -1.400329 2.154324
H  -4.833871 3.43176 -0.143274
H  -3.347019 3.924917 -0.998736
H  -3.804832 4.727903 0.531236
H  3.443609 -1.390095 1.272399
H  1.583595 1.621686 -1.258719
H  5.616497 -0.172931 1.117234
H  3.774014 2.793753 -1.470043
H  5.802544 1.917256 -0.269688
