program: Gaussian 09
title: 000257084
version: EM64L-G09RevD.01
frameworkgroup: C1[X(C4H4Cl2N4O2)]
method: RPBEPBE
basis: SDD
operation: Freq
keyword: #p
keyword: freq=noraman
keyword: PBEPBE/SDD
title: #p freq=noraman PBEPBE/SDD
converged: NO YES NO NO
title: Mulliken charges:
elementType: Cl Cl O O N N N N C C C C H H H H
charge: 0.145112 0.145113 -0.200911 -0.200910 -0.374997 -0.374997 -0.397055 -0.397055 -0.114523 -0.114520 0.286934 0.286930 0.301480 0.301478 0.353961 0.353961
chargesum: 0.00000
title: Mulliken charges with hydrogens summed into heavy atoms:
elementType: Cl Cl O O N N N N C C C C
charge: 0.145112 0.145113 -0.200911 -0.200910 -0.374997 -0.374997 -0.043094 -0.043094 0.186956 0.186958 0.286934 0.286930
polarizability: 1.25782707e+02 1.09958583e+01 9.08625549e+01 3.86300136e-04 6.08244471e-04 6.30655610e+01
1716.lowfreq: -11.0389 -7.7243 0.0011 0.0015 0.0025 1.5704 48.8451 84.0563 89.3013
frequency: 48.8434 84.0517 89.2939 165.9936 171.1344 189.0061 196.1023 293.3219 342.3248 435.2860 457.1262 475.3800 492.7689 533.8053 588.6647 603.9964 675.5701 678.2259 708.7489 742.8272 834.9754 866.8244 974.0704 978.3529 1004.7804 1086.2057 1090.3223 1090.9877 1132.8800 1202.6941 1222.8676 1309.3912 1317.0295 1336.4617 1370.8478 1379.8801 1714.1841 1725.0305 3062.9269 3074.8145 3601.8569 3601.9944
redmass: 14.2902 13.1077 14.0152 7.5838 9.2705 13.5663 11.9487 21.0628 6.0694 4.7504 11.6447 1.1622 1.3794 8.0780 5.1729 6.3463 12.1561 11.1629 9.3981 8.0598 6.9742 2.6865 5.4743 4.8644 3.0760 3.0946 4.9777 8.1128 4.9773 2.5782 1.8824 1.2426 1.8480 1.3011 1.5651 1.5674 10.3766 10.4249 1.0882 1.0889 1.0795 1.0797
irintensity: 0.3109 0.3567 8.0361 10.3244 3.4285 2.9083 17.5295 1.2130 35.3533 20.8661 3.8383 166.0240 76.7183 3.8664 68.0597 11.4346 43.7108 17.5899 61.5274 50.2619 23.6318 2.2952 41.2318 4.4619 5.1685 38.7626 0.0197 226.4875 0.0096 237.9750 0.0183 92.2876 69.6586 7.3917 30.6941 10.9215 641.5688 262.8240 1.8972 35.9838 2.2460 143.2886
temp: 298.150 k
press: 1.00000 atm
elementType: 17 17 8 8 7 7 7 7 6 6 6 6 1 1 1 1
symmnumber: 1
zpe: 256909.1 jmol-1
zpe.correction: 0.097852 hartree
zpe.thermalcorrener: 0.108621 hartree
zpe.thermalcorrenthalpy: 0.109565 hartree
zpe.thermalcorrgfe: 0.059889 hartree
zpe.sumelectzpe: -1443.453719 hartree
zpe.sumelectthermal: -1443.442950 hartree
zpe.sumelectthermalent: -1443.442006 hartree
zpe.sumelectthermalfe: -1443.491681 hartree
dipole: 0.0000 0.0000 4.1319
dipole: 4.1319
quadrupole: -95.4273 -80.1707 -83.1884
quadrupole: 17.8014 0.0002 0.0001
quadrupole: -9.1651 6.0914 3.0737 17.8014 0.0002 0.0001
hfenergy: -1443.5515709 hartree
pointgroup: C01 [X(C4H4Cl2N4O2)]
dipole: -0.000008 0.0000109 1.6255957 debye
dipolederiv: -0.112036 -0.0694472 -0.0342282 -0.2116995 -0.255607 0.0093797 -0.2068616 -0.1627433 0.0304399 -0.1120342 -0.0694407 0.0342299 -0.2116847 -0.2555936 -0.009372 0.2068675 0.1627519 0.0304384 -0.8881486 0.2464833 -0.3377776 0.2141403 -0.5434659 0.1886958 -0.442969 0.2730116 -0.6115139 -0.8881588 0.2464976 0.3377509 0.2141474 -0.5434742 -0.1886836 0.4429881 -0.2730288 -0.6114962 -0.3918632 0.3087641 0.0718453 0.4693167 -0.231997 0.2842605 0.1980663 0.7645199 -0.5266044 -0.3918808 0.3087684 -0.0718499 0.4692984 -0.2320627 -0.2842777 -0.1980779 -0.764522 -0.5265749 -1.2179935 -0.098796 0.1100725 -0.0787024 -0.5518288 0.0626837 0.2918698 0.0125708 -0.5894658 -1.2179907 -0.0987996 -0.1100676 -0.0787237 -0.5518365 -0.0626843 -0.2918883 -0.0125734 -0.5894685 1.0190876 -0.2226018 -0.0251687 -0.5893994 0.06128 0.0229539 -0.1001611 -0.0789868 0.633712 1.0191017 -0.2225996 0.0251711 -0.5893972 0.0612761 -0.0229396 0.1001789 0.0790064 0.6337136 1.4258982 -0.1199385 0.5439362 0.1673501 1.2327837 -0.4056597 0.5347897 -0.7666555 0.8315068 1.4259213 -0.1199674 -0.543915 0.1673274 1.2328283 0.4056462 -0.5348015 0.7666535 0.8314556 -0.0492132 0.014401 0.0235523 0.0438449 0.0307446 0.0724205 0.0161661 0.042892 -0.0695122 -0.0492142 0.0143996 -0.02355 0.0438456 0.0307406 -0.072423 -0.0161637 -0.0428961 -0.0695101 0.2142597 -0.0588601 0.0884063 -0.01483 0.2581044 -0.0445277 0.1370277 -0.02634 0.3014431 0.2142648 -0.0588629 -0.0884072 -0.0148338 0.258108 0.0445271 -0.137031 0.0263398 0.3014367 unknown
polarizability: 114.405147|19.717154|102.2401151|-0.000151|-0.0007046|63.065561 unknown
InChI: InChI=1S/C4H4Cl2N4O2/c5-9-1-2(8-4(9)12)10(6)3(11)7-1/h1-2,7-8H
charge 0 multiplicity 1
16 atoms
Cl -2.64766 -1.835352 -0.140419
Cl 2.647634 1.835334 -0.140468
O  -2.622826 1.182881 -1.061311
O  2.622828 -1.182923 -1.061254
N  -1.691551 -0.418455 0.484231
N  1.691539 0.418453 0.48424
N  0.544656 -1.465005 0.069249
N  -0.544665 1.464988 0.069203
C  -0.329562 -0.720297 0.979376
C  0.329543 0.720304 0.97936
C  -1.720424 0.792989 -0.299033
C  1.720435 -0.793029 -0.298968
H  -0.388054 -1.179629 1.978293
H  0.388022 1.179662 1.978267
H  0.418873 -2.452906 -0.146154
H  -0.418889 2.452887 -0.146212
