program: Gaussian 09
title: 000257077
version: EM64L-G09RevD.01
frameworkgroup: C1[X(C9H15Cl2N3O2)]
method: RPBEPBE
basis: SDD
operation: Freq
keyword: #p
keyword: freq=noraman
keyword: PBEPBE/SDD
title: #p freq=noraman PBEPBE/SDD
converged: YES YES NO NO
title: Mulliken charges:
elementType: Cl Cl O O N N N C C C C C C C C C H H H H H H H H H H H H H H H
charge: -0.058619 -0.044840 -0.258925 -0.235369 -0.406216 -0.181883 0.038025 -0.045315 -0.405652 -0.403734 -0.387945 -0.423379 -0.394953 0.341081 -0.336340 -0.567313 0.287492 0.269409 0.229781 0.207479 0.239253 0.219679 0.206795 0.220931 0.206192 0.218650 0.346116 0.268770 0.274762 0.277929 0.298139
chargesum: 0.00000
title: Mulliken charges with hydrogens summed into heavy atoms:
elementType: Cl Cl O O N N N C C C C C C C C C
charge: -0.058619 -0.044840 -0.258925 -0.235369 -0.060100 -0.181883 0.038025 0.242177 -0.136243 0.033525 0.070987 0.004347 0.029889 0.341081 0.207192 0.008755
polarizability: 1.83347209e+02 -1.08890841e+01 1.24581502e+02 5.03934461e-01 9.72479349e+00 1.24523774e+02
1716.lowfreq: -34.0078 -3.9979 -0.0015 -0.0003 0.0012 8.1520 12.1603 31.2202 38.9792
frequency: -23.9809 30.7899 38.7556 53.2776 62.8502 74.7182 122.5005 135.5941 155.8938 204.7099 209.8060 241.2243 252.8304 287.2144 306.1664 324.1279 333.0721 380.0493 413.1782 455.5557 470.7462 496.6706 521.0479 616.9984 672.7949 692.2202 706.4763 710.2184 730.1005 784.8052 802.8761 816.6280 842.5239 856.7126 886.7936 906.3948 928.6363 977.4153 996.2976 1032.1571 1045.3793 1053.5601 1071.5635 1097.2666 1111.4062 1127.5090 1146.6927 1205.8120 1213.0481 1217.0573 1240.0607 1246.4753 1259.0743 1266.8972 1290.0843 1312.9236 1322.4089 1328.5653 1333.0878 1341.7933 1353.5690 1357.1916 1365.6186 1374.9475 1438.8480 1455.2232 1455.3629 1468.4219 1477.0721 1480.8257 1503.7729 1667.1634 2976.1219 2978.8524 2986.6168 2996.0640 3042.3841 3046.4122 3048.3009 3053.5069 3059.3908 3061.4419 3071.1802 3074.7330 3120.9231 3161.4853 3498.3848
redmass: 8.0178 5.6478 11.4877 10.6225 2.9366 4.0287 5.6830 4.8257 6.1537 3.5171 5.5122 8.0092 5.7768 2.9510 3.0934 5.1695 3.2596 2.5045 5.7052 9.9539 2.4525 5.2284 3.0087 2.8361 1.4079 5.3111 3.2682 5.4748 2.2354 1.8057 1.7144 3.1506 3.9454 2.4909 2.1949 1.8667 2.1884 2.2848 2.5770 1.7145 1.9850 2.4593 1.7162 1.6846 2.2067 1.7496 2.0689 1.4368 1.7935 1.4338 1.3306 2.2311 1.3974 1.1865 1.3803 1.3340 1.1942 1.3605 1.4617 1.4379 1.4233 1.3117 1.9019 2.9502 1.1090 1.0928 1.0866 1.0864 1.0948 1.2775 1.4791 10.1940 1.0681 1.0614 1.0629 1.0640 1.0949 1.0590 1.0987 1.0895 1.0998 1.0884 1.0559 1.0969 1.1048 1.1128 1.0768
irintensity: 0.2276 0.3012 0.4025 1.6527 0.5787 1.2662 4.9960 5.0741 4.5330 1.2830 1.2575 10.4543 5.9178 1.1964 16.4160 13.3207 12.1884 9.0073 3.6284 1.1704 2.2357 6.3453 2.7304 2.0225 74.8259 43.6685 33.0695 39.0916 9.2435 82.0224 26.9019 22.2076 3.5365 2.7989 9.4778 63.3542 83.8416 20.6389 10.9065 5.4326 34.2583 10.5369 1.9604 1.6843 6.7007 4.1090 26.9776 7.9783 4.1744 6.5704 10.6035 33.6189 8.1531 4.5120 5.1632 4.5785 6.2182 29.1616 33.8158 0.9993 1.9217 9.8940 126.2310 60.1032 18.6364 9.5107 9.2624 5.5307 20.9882 169.3193 352.0329 253.6429 19.1641 35.4687 27.8220 13.1398 47.2727 2.2829 43.3930 7.4508 24.2132 4.4993 11.7229 62.5291 1.1475 2.2288 33.8714
temp: 298.150 k
press: 1.00000 atm
elementType: 17 17 8 8 7 7 7 6 6 6 6 6 6 6 6 6 1 1 1 1 1 1 1 1 1 1 1 1 1 1 1
symmnumber: 1
zpe: 642007.7 jmol-1
zpe.correction: 0.244528 hartree
zpe.thermalcorrener: 0.260542 hartree
zpe.thermalcorrenthalpy: 0.261486 hartree
zpe.thermalcorrgfe: 0.198955 hartree
zpe.sumelectzpe: -1585.493396 hartree
zpe.sumelectthermal: -1585.477382 hartree
zpe.sumelectthermalent: -1585.476437 hartree
zpe.sumelectthermalfe: -1585.538968 hartree
dipole: 5.8594 -1.7343 0.6658
dipole: 6.1469
quadrupole: -106.4781 -115.9854 -115.4063
quadrupole: -2.5042 2.1596 -5.2661
quadrupole: 6.1451 -3.3621 -2.7830 -2.5042 2.1596 -5.2661
hfenergy: -1585.7379235 hartree
pointgroup: C01 [X(C9H15Cl2N3O2)]
dipole: -2.2521772 -0.0453392 -0.8798281 debye
polarizability: 181.6718224|3.7692681|131.6152836|14.3687569|7.0977753|119.1653791 unknown
InChI: InChI=1S/C9H15Cl2N3O2/c10-5-6-14(13-16)9(15)12-8-4-2-1-3-7(8)11/h7-8,12H,1-6H2
charge 0 multiplicity 1
31 atoms
Cl -1.48072 0.258074 2.619391
Cl 5.555327 0.562281 1.018851
O  1.086855 1.917126 -0.015845
O  2.308381 -2.434832 -0.897594
N  -0.517071 0.23519 -0.386776
N  1.798037 -0.270025 -0.495556
N  1.372674 -1.580058 -0.744995
C  -1.69813 1.059909 -0.088736
C  -2.548061 0.4576 1.054173
C  -2.613263 1.218743 -1.340552
C  -3.194375 -0.887286 0.697081
C  -3.285548 -0.114414 -1.747889
C  -4.080623 -0.725185 -0.56896
C  0.754476 0.729289 -0.274297
C  3.223543 0.121888 -0.43122
C  3.731029 0.091509 1.020299
H  -1.313858 2.047356 0.219351
H  -3.313312 1.193054 1.355592
H  -2.006824 1.628212 -2.168643
H  -3.395057 1.969293 -1.107198
H  -3.796224 -1.247143 1.549994
H  -2.409607 -1.649077 0.520954
H  -2.515966 -0.834609 -2.093488
H  -3.956712 0.056701 -2.609988
H  -4.942777 -0.069624 -0.329742
H  -4.497613 -1.709833 -0.850792
H  -0.609709 -0.764463 -0.591254
H  3.790798 -0.59319 -1.050581
H  3.313326 1.140279 -0.838833
H  3.678455 -0.912917 1.464024
H  3.22405 0.838654 1.646431
