program: Gaussian 09
title: 000257076
version: EM64L-G09RevD.01
frameworkgroup: C1[X(C9H17ClN2O2)]
method: RPBEPBE
basis: SDD
operation: Freq
keyword: #p
keyword: freq=noraman
keyword: PBEPBE/SDD
title: #p freq=noraman PBEPBE/SDD
converged: YES YES NO NO
title: Mulliken charges:
elementType: Cl O O N N C C C C C C C C C H H H H H H H H H H H H H H H H H
charge: -0.087245 -0.440307 -0.300796 -0.464418 -0.401356 -0.129179 -0.076792 -0.409933 -0.447891 -0.412446 -0.389228 0.298261 -0.327392 -0.548891 0.288154 0.220001 0.204150 0.220290 0.183642 0.233013 0.215670 0.181246 0.207639 0.202842 0.285466 0.340362 0.297139 0.242189 0.270203 0.278230 0.267379
chargesum: 0.00000
title: Mulliken charges with hydrogens summed into heavy atoms:
elementType: Cl O O N N C C C C C C C C C
charge: -0.087245 -0.099945 -0.300796 -0.178952 -0.104217 0.158975 0.143209 0.014507 -0.031237 -0.015530 0.021253 0.298261 0.185000 -0.003282
polarizability: 1.50333344e+02 3.65372157e+00 1.17498957e+02 2.73126862e+00 -8.48423654e+00 1.06364837e+02
1716.lowfreq: -27.6287 -11.5259 -5.0646 0.0020 0.0023 0.0026 17.4098 25.2722 55.1417
frequency: 15.3502 19.0950 54.4444 66.0488 87.1460 112.2853 155.1934 167.8666 214.6134 240.0121 273.8393 318.6930 326.6268 356.9941 377.0018 394.8960 411.2582 433.4946 476.5712 485.3687 549.7472 593.2797 597.7314 607.0301 700.5518 711.1991 773.3648 806.8250 837.6056 838.8727 892.2212 907.8600 941.3431 954.4020 984.0285 999.4945 1020.6532 1036.1143 1048.7793 1067.9245 1095.4261 1113.0715 1125.1967 1147.0284 1176.8495 1202.4351 1208.7263 1221.2327 1234.3578 1242.4847 1257.2226 1294.1321 1298.5164 1311.4028 1320.7564 1331.2119 1339.8293 1347.3992 1356.7198 1369.7790 1372.8995 1439.8050 1444.7582 1453.9170 1456.5968 1469.0471 1473.1545 1481.2629 1499.0642 1635.5380 2952.4921 2961.8771 2973.8221 2981.3225 2992.4948 3023.3176 3032.9681 3038.6245 3048.2034 3050.8555 3051.4874 3056.3800 3065.1950 3153.9840 3500.9691 3527.6730 3547.6598
redmass: 5.6366 4.5764 6.8934 6.6669 3.7542 3.3044 3.7293 5.2478 2.5858 5.1987 2.1996 2.0355 1.7579 2.2137 2.1365 1.8598 2.0592 2.3747 2.3886 2.7287 1.5478 3.9142 2.4213 2.1940 3.8151 8.6239 2.3686 1.6103 2.5517 2.1144 1.9196 1.6920 2.3850 2.8862 2.4326 1.9694 2.6155 1.5734 2.0222 1.7610 1.3677 2.6051 1.9411 1.7645 1.5890 1.5515 1.6343 1.3451 1.3096 1.4783 1.3454 1.3808 1.1728 1.3497 1.4739 1.3676 1.4268 1.3639 1.4385 1.3100 1.2873 1.1098 1.1433 1.0906 1.4159 1.0914 1.0880 1.1694 1.9641 5.1876 1.0680 1.0681 1.0614 1.0625 1.0597 1.0851 1.0927 1.0995 1.1004 1.0957 1.0886 1.0952 1.0624 1.1120 1.0649 1.0760 1.0771
irintensity: 1.5168 1.1824 1.5058 8.2959 10.4795 6.2588 4.0618 0.9749 1.2392 6.6064 6.4755 11.1678 11.7684 27.9461 9.2875 49.9017 11.6922 13.6666 17.6587 3.9581 160.8883 20.2985 74.0999 55.9750 4.3810 5.8921 2.5976 7.7905 7.0642 20.7565 3.3020 17.7170 13.7558 13.2019 10.4398 33.6379 55.6371 14.1135 5.5864 3.1458 1.3249 18.0958 9.2008 1.6721 14.6543 83.9281 21.1988 16.1274 9.9487 163.6779 13.2954 11.6963 32.2118 3.4890 72.9899 3.6974 6.7123 9.4974 5.9419 12.9622 15.2394 12.8267 48.0569 15.4923 74.9182 16.0407 7.5420 37.3719 552.5452 173.4107 29.0596 24.9106 42.5750 24.4762 50.6821 25.4971 54.7662 53.8201 31.0345 5.4584 9.3822 83.7635 21.9648 16.1207 13.1926 11.8764 20.8718
temp: 298.150 k
press: 1.00000 atm
elementType: 17 8 8 7 7 6 6 6 6 6 6 6 6 6 1 1 1 1 1 1 1 1 1 1 1 1 1 1 1 1 1
symmnumber: 1
zpe: 685071.3 jmol-1
zpe.correction: 0.260930 hartree
zpe.thermalcorrener: 0.276188 hartree
zpe.thermalcorrenthalpy: 0.277132 hartree
zpe.thermalcorrgfe: 0.215652 hartree
zpe.sumelectzpe: -1072.067092 hartree
zpe.sumelectthermal: -1072.051834 hartree
zpe.sumelectthermalent: -1072.050890 hartree
zpe.sumelectthermalfe: -1072.112370 hartree
dipole: -0.4872 3.2697 -0.1029
dipole: 3.3074
quadrupole: -90.3908 -103.0969 -93.1705
quadrupole: 14.7690 1.9416 0.8927
quadrupole: 5.1620 -7.5442 2.3822 14.7690 1.9416 0.8927
hfenergy: -1072.3280224 hartree
pointgroup: C01 [X(C9H17Cl1N2O2)]
dipole: -0.1281336 -1.2748073 0.22734 debye
polarizability: 150.161194|-3.2745649|114.702766|-4.5732676|-9.5669664|109.3331776 unknown
InChI: InChI=1S/C9H17ClN2O2/c10-5-6-11-9(14)12-7-3-1-2-4-8(7)13/h7-8,11-13H,1-6H2
charge 0 multiplicity 1
31 atoms
Cl -4.677122 -1.52266 1.245656
O  2.182999 2.081593 0.952035
O  -1.197684 1.530134 -1.237537
N  0.155868 0.197627 0.149522
N  -2.159266 0.364561 0.548766
C  1.376195 0.375273 -0.672214
C  2.547381 0.859564 0.226996
C  1.774876 -0.916415 -1.434231
C  3.03694 -0.250412 1.185816
C  2.28023 -2.031633 -0.485743
C  3.442262 -1.524764 0.403187
C  -1.075264 0.741875 -0.249634
C  -3.509228 0.849403 0.266104
C  -4.467904 -0.260076 -0.165547
H  1.120525 1.174602 -1.389866
H  3.383597 1.159925 -0.431823
H  2.583886 -0.657108 -2.146836
H  0.91456 -1.263433 -2.036594
H  2.234917 -0.49341 1.915369
H  3.885064 0.140765 1.776283
H  2.603639 -2.907606 -1.079361
H  1.448927 -2.388253 0.159648
H  3.764777 -2.317135 1.105107
H  4.31595 -1.293886 -0.240471
H  0.158974 -0.55588 0.840914
H  1.238455 1.971681 1.243211
H  -2.047919 -0.293602 1.321902
H  -3.925598 1.380809 1.14291
H  -3.412644 1.576912 -0.562887
H  -4.084794 -0.841158 -1.016415
H  -5.482098 0.119006 -0.360667
