program: Gaussian 09
title: 000257073
version: EM64L-G09RevD.01
frameworkgroup: C1[X(C17H13NO3)]
method: RPBEPBE
basis: SDD
operation: Freq
keyword: #p
keyword: freq=noraman
keyword: PBEPBE/SDD
title: #p freq=noraman PBEPBE/SDD
converged: NO YES NO NO
title: Mulliken charges:
elementType: O O O N C C C C C C C C C C C C C C C C C H H H H H H H H H H H H H
charge: -0.221899 -0.182984 -0.122048 -0.208928 -0.075363 0.359030 0.356803 0.310266 0.065465 -0.367075 -0.378774 -0.367012 -0.378767 -0.635626 0.083890 -0.223386 -0.226659 -0.223375 -0.226676 -0.236530 -0.235653 0.228810 0.244078 0.228883 0.244073 0.263900 0.263890 0.271817 0.228629 0.233460 0.228640 0.233456 0.231045 0.234620
chargesum: 0.00000
title: Mulliken charges with hydrogens summed into heavy atoms:
elementType: O O O N C C C C C C C C C C C C C C C C C
charge: -0.221899 -0.182984 -0.122048 -0.208928 -0.075363 0.359030 0.356803 0.310266 0.065465 -0.138266 -0.134696 -0.138129 -0.134694 0.163980 0.083890 0.005242 0.006801 0.005265 0.006780 -0.005485 -0.001033
polarizability: 2.41276838e+02 -7.08903763e+00 2.15974903e+02 -5.85730211e-02 5.58500778e-02 1.56891583e+02
1716.lowfreq: -53.5999 -30.5931 -4.4207 -4.2644 -0.0008 -0.0005 0.0003 1.9304 44.4421
frequency: -53.5826 -30.5127 44.4277 48.2988 59.6575 62.3110 107.8899 145.3963 175.1957 194.4736 233.9856 237.6880 250.0453 254.6708 288.0186 324.5751 333.0150 393.6931 399.4547 457.8741 473.2672 509.3307 532.9688 545.2195 584.0708 610.2978 612.4016 640.3656 655.2884 676.4774 679.8532 698.3584 708.1035 736.0294 747.7585 752.9763 797.3566 845.9357 858.0858 892.2925 909.4512 925.6980 940.4857 971.2081 972.0426 980.3226 987.5980 989.0935 994.1975 999.6294 1020.6028 1027.9184 1034.1934 1074.2383 1080.6409 1118.8481 1124.6624 1173.0823 1174.0575 1176.6451 1185.7939 1189.0387 1271.4895 1281.8844 1302.2681 1313.1728 1338.4418 1364.2000 1370.4419 1425.9256 1429.7248 1440.1582 1476.8532 1476.9997 1477.7957 1480.7665 1580.9241 1585.1833 1604.1362 1608.3181 1650.6052 1676.6089 1737.5858 3008.0395 3109.0368 3114.7893 3124.9208 3126.1614 3128.0045 3130.2161 3141.1063 3142.6278 3150.5409 3151.5852 3166.8307 3167.8342
redmass: 3.7136 3.9594 4.7818 5.6085 6.3295 7.0961 4.5753 7.0682 1.0848 5.0934 4.6635 4.3878 6.5679 4.6733 5.5915 5.5912 7.1435 2.8039 2.8547 10.8061 3.5820 3.8953 8.8081 6.8539 7.7969 6.8125 6.4799 6.7187 8.6677 9.2453 6.7644 1.8858 1.7781 11.9882 2.5050 1.8964 3.2772 1.2480 1.2405 4.0455 1.8096 1.8860 2.9567 1.3899 3.5680 1.3790 6.0666 6.0916 1.3224 1.3289 3.9839 2.1859 2.5116 1.6140 1.6039 4.4305 1.3131 1.0519 1.0526 3.0031 1.1112 1.1124 3.3538 4.4715 1.4076 1.3584 7.1148 5.8453 7.2464 2.1949 2.2073 1.2110 1.6857 1.0559 2.1746 1.3159 5.9296 6.0540 6.1489 6.1502 11.6955 11.3762 12.8192 1.0325 1.1026 1.1021 1.0847 1.0850 1.0879 1.0879 1.0921 1.0924 1.0967 1.0968 1.1018 1.1017
irintensity: 0.0272 0.2517 1.8996 0.7607 0.7017 0.2902 2.0374 0.1189 0.0004 3.3508 0.0259 0.3124 0.1989 0.4144 0.1152 7.1862 1.0442 0.0047 0.0079 16.9310 5.9607 7.1606 1.3204 4.9343 8.6648 1.1066 0.0695 18.5559 1.6345 2.4372 11.2705 43.0263 74.4816 0.0005 17.5038 28.9091 54.1537 0.0056 0.1823 28.7908 44.5336 14.6640 46.5938 0.0169 7.8558 0.1959 2.5769 5.6163 0.0339 0.2387 27.8269 1.3355 19.6794 0.0734 22.2776 91.2600 0.1503 0.0098 0.0142 14.2387 0.6082 2.8804 28.9388 17.7782 0.0014 1.5936 59.2672 0.0001 0.0655 0.0158 15.1177 39.0393 30.4999 27.0829 17.8965 17.6996 0.7138 3.6324 7.1864 7.3071 392.8058 46.9213 543.3616 20.0035 10.8800 1.1789 5.8730 3.0675 0.0015 0.0001 20.1933 6.9962 1.2405 62.9446 25.4531 20.7795
temp: 298.150 k
press: 1.00000 atm
elementType: 8 8 8 7 6 6 6 6 6 6 6 6 6 6 6 6 6 6 6 6 6 1 1 1 1 1 1 1 1 1 1 1 1 1
symmnumber: 1
zpe: 670936.0 jmol-1
zpe.correction: 0.255546 hartree
zpe.thermalcorrener: 0.271763 hartree
zpe.thermalcorrenthalpy: 0.272707 hartree
zpe.thermalcorrgfe: 0.211096 hartree
zpe.sumelectzpe: -934.561788 hartree
zpe.sumelectthermal: -934.545571 hartree
zpe.sumelectthermalent: -934.544627 hartree
zpe.sumelectthermalfe: -934.606239 hartree
dipole: 6.4215 -3.6280 -0.0070
dipole: 7.3755
quadrupole: -150.9039 -112.6736 -107.5915
quadrupole: 6.3456 0.0218 -0.0011
quadrupole: -27.1809 11.0494 16.1315 6.3456 0.0218 -0.0011
hfenergy: -934.8173342 hartree
pointgroup: C01 [X(C17H13N1O3)]
dipole: -1.1271618 -2.6738985 0.0033951 debye
polarizability: 224.9658133|14.0322984|232.2858837|-0.0135528|-0.0984845|156.891627 unknown
InChI: InChI=1S/C17H13NO3/c1-18-15(19)17(20)21-16(18)14(12-8-4-2-5-9-12)13-10-6-3-7-11-13/h2-11H,1H3
charge 0 multiplicity 1
34 atoms
O  0.645869 2.155446 0.000699
O  4.226835 1.88386 -0.000336
O  2.016181 4.062774 -0.003444
N  2.266798 0.531765 0.000481
C  -0.193183 -0.113825 0.000428
C  0.866005 0.744758 0.00069
C  -1.596774 0.434795 0.000101
C  -0.048512 -1.610611 0.000327
C  2.980921 1.742369 -0.000231
C  -2.274934 0.672641 1.222597
C  -0.015601 -2.331499 -1.222133
C  -2.272865 0.676561 -1.222774
C  -0.014758 -2.331688 1.222658
C  2.96549 -0.76203 0.0000
C  1.913627 2.835958 0.00401
C  -3.605306 1.147611 1.221824
C  0.069231 -3.742198 -1.222237
C  -3.603249 1.151504 -1.222736
C  0.070059 -3.742389 1.222493
C  -4.273874 1.386976 -0.000643
C  0.114786 -4.451963 0.000058
H  -1.757501 0.496244 2.172382
H  -0.058575 -1.785512 -2.171476
H  -1.753801 0.503244 -2.172236
H  -0.05703 -1.785844 2.172115
H  2.708684 -1.349631 -0.8958
H  2.70971 -1.349828 0.895962
H  4.044984 -0.538254 -0.000591
H  -4.116205 1.335437 2.172675
H  0.097538 -4.285152 -2.173451
H  -4.112548 1.342354 -2.173843
H  0.099014 -4.28549 2.173605
H  -5.305045 1.757029 -0.000922
H  0.178935 -5.545513 -0.000049
