program: Gaussian 09
title: 000257072
version: EM64L-G09RevD.01
frameworkgroup: C1[X(C16H23NO3S)]
method: RPBEPBE
basis: SDD
operation: Freq
keyword: #p
keyword: freq=noraman
keyword: PBEPBE/SDD
title: #p freq=noraman PBEPBE/SDD
converged: YES YES NO NO
title: Mulliken charges:
elementType: S O O O N C C C C C C C C C C C C C C C C H H H H H H H H H H H H H H H H H H H H H H H
charge: 0.156341 -0.397774 -0.208401 -0.252260 -0.599056 -0.353316 -0.546598 -0.356716 -0.391867 0.536436 -0.350620 0.168622 -0.351115 -0.691220 0.240222 -0.370779 -0.387924 -0.696849 -0.247615 -0.235788 -0.241217 0.285070 0.220838 0.217406 0.246079 0.239148 0.237381 0.188002 0.191894 0.194382 0.221902 0.237368 0.221783 0.241002 0.253412 0.214647 0.215830 0.211683 0.228190 0.227802 0.231220 0.330909 0.343996 0.377552
chargesum: 0.00000
title: Mulliken charges with hydrogens summed into heavy atoms:
elementType: S O O O N C C C C C C C C C C C C C C C C
charge: 0.156341 -0.020222 -0.208401 -0.252260 0.075849 -0.353316 -0.261528 0.081527 0.093359 0.536436 0.074763 0.168622 0.035161 -0.010167 0.240222 -0.129777 -0.134513 -0.054690 -0.019424 -0.007985 -0.009996
polarizability: 2.72286199e+02 7.52973105e+00 1.90858630e+02 7.18625039e+00 1.46701054e+01 1.59142158e+02
1716.lowfreq: -11.1167 -5.9027 -0.6044 -0.0011 0.0012 0.0016 6.0886 22.6208 26.4565
frequency: -4.5063 21.4587 26.3016 44.2362 45.3629 54.5643 72.6993 82.6113 91.5523 110.3282 115.8915 130.2528 150.7311 166.1096 180.4930 197.1496 213.1182 220.2202 234.6786 252.8297 268.1185 296.6561 337.5722 357.8968 371.6873 390.9053 400.2754 406.3072 441.3650 466.9996 512.0267 521.2513 556.0089 573.0581 607.0600 609.0959 619.9059 636.5243 699.1777 704.1825 706.3522 728.2799 746.7800 751.4744 769.8064 774.8197 831.5338 841.4618 854.3671 896.8852 900.8858 917.2738 937.7570 942.0636 979.6442 989.7779 996.4354 997.5794 1028.6905 1041.5762 1057.9088 1063.7337 1071.9834 1083.8471 1091.9588 1095.8196 1102.0767 1104.1661 1113.0987 1174.6947 1183.6223 1197.3522 1201.3091 1204.0307 1261.8308 1266.4921 1273.6488 1289.8390 1290.6877 1304.8073 1321.6179 1324.5027 1336.3757 1346.9958 1357.2455 1377.1330 1390.9503 1393.9641 1433.0911 1462.3636 1467.5780 1467.8293 1469.2185 1476.6354 1478.1717 1481.9389 1488.3039 1488.4590 1567.2471 1589.2755 1609.8474 1630.2110 1634.2883 2962.2539 2973.9944 2975.0579 2983.3576 2989.0426 3001.9416 3007.9480 3027.6342 3052.6355 3058.0497 3072.1036 3073.4439 3076.7864 3083.9443 3089.8612 3113.0968 3128.6657 3140.9250 3153.0813 3165.9835 3471.7582 3514.1490 3644.6373
redmass: 6.2156 4.0738 4.0038 3.0278 2.9260 4.2202 4.2011 4.6842 3.8840 3.4053 3.9198 2.7821 4.6583 2.2468 3.0473 2.0453 2.7496 2.0077 1.4895 4.2022 4.6671 2.6976 4.2785 5.1037 4.8360 3.9362 2.8805 7.3010 4.0362 3.7801 2.7433 1.9379 2.0007 2.3952 1.2722 3.9968 4.8412 1.4552 3.7188 1.9671 3.0669 1.1462 5.4928 1.6495 1.6006 1.9363 1.8090 2.0793 1.2485 2.0288 3.0584 1.6751 1.3711 2.3759 1.3872 6.1603 1.4222 3.2080 2.3922 2.6126 2.3271 2.0566 2.3208 1.9471 2.0703 1.6416 1.9282 2.0886 2.0245 1.0516 1.2986 1.6882 1.5994 1.4898 1.3002 1.2831 1.2085 1.4432 1.4445 1.1642 1.4877 1.3521 1.4309 2.0839 1.8497 7.0421 1.2133 1.2136 2.2445 1.0792 1.0682 1.0794 1.0584 1.0422 1.0695 2.0594 1.0596 1.0833 1.4567 6.0539 6.0430 5.1768 5.5190 1.0589 1.0492 1.0468 1.0637 1.0356 1.0630 1.0974 1.0999 1.0980 1.1011 1.0993 1.0989 1.0888 1.0993 1.0998 1.0881 1.0862 1.0917 1.0948 1.1012 1.0472 1.0640 1.1018
irintensity: 1.2930 0.2131 0.3079 0.8713 0.3644 0.2093 1.6394 7.0499 0.7674 0.5311 0.0924 1.4049 0.6496 0.8304 1.3985 1.7965 0.1833 0.5748 0.7969 0.1011 9.8303 0.7706 0.1582 7.5176 2.2304 3.3941 0.1229 5.3812 2.9976 1.2965 6.3090 111.3333 136.9594 167.7533 3.2417 25.2477 16.1938 23.3671 25.7419 30.5934 27.5215 6.8941 13.5317 20.9373 5.2594 32.7278 4.5535 18.2888 0.4522 2.1016 3.9498 17.8591 4.0008 33.9479 0.2864 1.2187 0.3287 0.1194 10.3665 3.5985 69.6040 8.9812 3.6620 11.0114 25.3808 14.9765 25.0830 53.9421 22.2186 0.2204 7.8379 2.8120 3.8378 2.9254 12.0834 11.8675 8.1641 10.8403 3.4980 2.9345 22.1811 2.0536 3.3190 49.7934 22.3251 0.6672 11.3607 22.8165 10.3363 1.2163 1.2831 12.6730 3.8298 12.3204 2.5344 26.1818 15.6006 12.4256 102.0012 6.6627 19.8888 73.8931 348.3558 25.9637 15.2480 25.3918 44.4846 24.0347 7.6453 15.1057 1.9531 6.3512 12.7083 64.2404 53.2366 36.5963 31.0396 40.1326 5.9726 0.1502 18.3279 23.0210 24.1984 35.0990 31.5181 59.7043
temp: 298.150 k
press: 1.00000 atm
elementType: 16 8 8 8 7 6 6 6 6 6 6 6 6 6 6 6 6 6 6 6 6 1 1 1 1 1 1 1 1 1 1 1 1 1 1 1 1 1 1 1 1 1 1 1
symmnumber: 1
zpe: 948678.2 jmol-1
zpe.correction: 0.361332 hartree
zpe.thermalcorrener: 0.384143 hartree
zpe.thermalcorrenthalpy: 0.385087 hartree
zpe.thermalcorrgfe: 0.307533 hartree
zpe.sumelectzpe: -1300.401017 hartree
zpe.sumelectthermal: -1300.378206 hartree
zpe.sumelectthermalent: -1300.377262 hartree
zpe.sumelectthermalfe: -1300.454816 hartree
dipole: -2.1312 -1.5873 -2.4909
dipole: 3.6423
quadrupole: -127.3820 -130.4349 -134.3205
quadrupole: -6.5746 -6.0537 -11.5479
quadrupole: 3.3305 0.2776 -3.6080 -6.5746 -6.0537 -11.5479
hfenergy: -1300.7623491 hartree
pointgroup: C01 [X(C16H23N1O3S1)]
dipole: -0.852366 0.5628851 1.0050541 debye
polarizability: 272.5919806|-4.8435558|189.3604464|-8.2003948|15.6167968|160.3345606 unknown
InChI: InChI=1S/C16H23NO3S/c1-3-5-11-13(14(17)18)21-16(4-2,15(19)20)12-9-7-6-8-10-12/h6-10,13,19H,3-5,11,17H2,1-2H3
charge 0 multiplicity 1
44 atoms
S  0.277796 0.421979 0.836832
O  -1.424292 -2.183823 1.242331
O  -0.955478 -2.715091 -0.960408
O  3.036711 -2.075932 -0.795907
N  1.855414 -2.204575 1.207503
C  -1.101511 -0.319436 -0.315382
C  1.917258 -0.049914 -0.025756
C  3.007244 0.850601 0.625632
C  -0.798611 -0.042323 -1.8169
C  -2.457722 0.294233 0.094345
C  4.380816 0.766144 -0.082713
C  -1.134308 -1.840332 -0.08426
C  5.430364 1.683724 0.586043
C  -0.66732 1.446725 -2.183671
C  2.29425 -1.539925 0.080953
C  -3.639383 -0.366006 -0.338731
C  -2.582996 1.514202 0.800315
C  6.802108 1.624915 -0.119983
C  -4.912187 0.174987 -0.064018
C  -3.859469 2.055953 1.078199
C  -5.028682 1.391139 0.6489
H  1.832394 0.198528 -1.095928
H  2.649325 1.898825 0.593828
H  3.119551 0.579252 1.694364
H  0.104621 -0.604463 -2.115863
H  -1.626694 -0.49519 -2.395753
H  4.74399 -0.27815 -0.08745
H  4.262827 1.054502 -1.147102
H  5.059601 2.72945 0.590172
H  5.548407 1.390378 1.649436
H  -0.469175 1.549785 -3.265563
H  -1.592198 2.003003 -1.951077
H  0.160356 1.929895 -1.63374
H  -3.566907 -1.309475 -0.894913
H  -1.686612 2.045809 1.134756
H  7.540556 2.282321 0.374657
H  7.206129 0.595295 -0.113985
H  6.718361 1.94388 -1.175943
H  -5.810988 -0.351245 -0.404285
H  -3.936072 2.999636 1.62982
H  -6.016542 1.81235 0.865729
H  2.131399 -3.177453 1.33615
H  1.179235 -1.764865 1.837043
H  -1.481168 -3.17611 1.303017
