program: Gaussian 09
title: 000257071
version: EM64L-G09RevD.01
frameworkgroup: C1[X(C14H19NO3S)]
method: RPBEPBE
basis: SDD
operation: Freq
keyword: #p
keyword: freq=noraman
keyword: PBEPBE/SDD
title: #p freq=noraman PBEPBE/SDD
converged: YES YES NO NO
title: Mulliken charges:
elementType: S O O O N C C C C C C C C C C C C C C H H H H H H H H H H H H H H H H H H H
charge: 0.130059 -0.267113 -0.417151 -0.220464 -0.599176 -0.367286 -0.395467 0.479112 -0.467785 0.222290 -0.364963 -0.699063 -0.378260 -0.374346 0.243259 -0.686374 -0.241360 -0.243249 -0.240724 0.251910 0.257688 0.298680 0.239126 0.225266 0.219506 0.239843 0.213383 0.279333 0.250078 0.211566 0.236294 0.225072 0.227692 0.226521 0.331055 0.340675 0.229830 0.384542
chargesum: 0.00000
title: Mulliken charges with hydrogens summed into heavy atoms:
elementType: S O O O N C C C C C C C C C C C C C C
charge: 0.130059 -0.267113 -0.032609 -0.220464 0.072554 -0.367286 0.114132 0.479112 -0.169105 0.222290 0.099429 -0.026330 -0.098927 -0.124269 0.243259 -0.013442 -0.013668 -0.016728 -0.010894
polarizability: 2.39386651e+02 -1.30507085e+00 1.74422097e+02 -7.29405339e-01 1.19973450e+01 1.39379348e+02
1716.lowfreq: -8.2008 -0.0013 -0.0007 0.0009 9.5408 12.0154 32.6693 42.2159 46.9654
frequency: 31.5922 42.1170 46.9324 62.4307 68.2802 80.5569 86.0861 100.6944 128.8345 140.1171 159.3962 177.5611 195.1007 203.9227 221.8758 237.5874 270.3913 279.2186 290.1434 322.2251 354.1249 368.8846 403.3279 404.5579 446.9677 455.3289 509.9155 557.9880 574.2732 582.8945 597.4179 613.5463 616.9597 631.2567 665.1151 708.2389 710.2974 745.9283 753.7222 769.3885 774.4404 835.1660 856.2735 862.0537 890.2832 923.5327 926.2250 960.2820 987.1102 989.2301 1001.7510 1030.7909 1032.5093 1042.6141 1061.6205 1083.9168 1085.6101 1095.6526 1097.6310 1106.5524 1123.4468 1174.7084 1181.6198 1186.1608 1205.1146 1233.1042 1266.2027 1269.3715 1324.7170 1328.9147 1331.9882 1340.5075 1355.2703 1374.4570 1392.0734 1396.0684 1432.2375 1465.1692 1469.7481 1477.0114 1479.2513 1481.0573 1486.7609 1489.3892 1556.8696 1586.0813 1608.0229 1620.7201 1658.6150 2981.4944 2983.6523 3006.8327 3011.3696 3057.0097 3057.7979 3075.1041 3076.5812 3085.2493 3087.1866 3090.6725 3124.2279 3132.8104 3145.1214 3152.3020 3164.9641 3476.6449 3518.3540 3644.3307
redmass: 3.9324 5.4052 5.6661 6.1897 4.9486 3.6275 3.6543 2.5663 5.4429 3.0644 4.5833 2.2708 2.3120 1.6308 2.5830 3.4936 2.3863 3.7797 3.1113 3.2496 6.3606 3.6691 3.3990 5.1478 3.7275 3.4681 3.2129 1.7256 2.7915 3.2464 2.2353 2.0589 1.7974 2.5101 2.1661 1.8417 4.5071 2.7301 1.6964 2.3173 1.9348 1.9736 1.8962 1.2462 3.1458 2.0519 1.6004 2.6479 1.4461 4.8990 1.3241 2.4432 2.4045 2.1867 1.8343 1.9276 2.8199 1.9418 1.7089 1.6865 2.1060 1.0549 1.4184 2.5215 1.1352 1.4678 1.2234 1.2801 1.8267 2.1631 1.4254 1.3755 1.6462 6.3494 1.2145 1.2041 2.2602 1.0733 1.0417 1.2355 1.0529 1.5873 1.0491 1.0842 1.5468 5.7115 5.8256 3.6811 7.5865 1.0362 1.0358 1.0601 1.0616 1.0991 1.0990 1.0993 1.0917 1.0975 1.0997 1.1001 1.0846 1.0880 1.0922 1.0957 1.1015 1.0471 1.0642 1.1021
irintensity: 0.2626 0.2605 3.6558 6.6272 1.5816 0.6878 1.9972 0.5846 0.7478 0.9306 0.6709 1.0954 0.2494 0.6639 2.7067 0.3780 9.4435 4.1260 0.1515 0.9430 2.2617 1.9374 0.4649 1.5904 11.4113 5.5892 4.0108 131.8462 18.1523 23.4794 14.5729 155.4305 53.7187 52.5473 53.9107 51.1535 2.3435 1.8281 26.4634 5.9668 30.9819 34.5829 2.6486 0.3774 2.7370 19.3656 12.4907 2.8808 0.4819 0.7066 0.1590 22.0049 149.8483 1.8083 14.3948 14.5480 3.1573 3.9660 7.5137 8.2176 27.5992 0.0401 9.5615 1.3750 6.2368 0.3707 10.5779 5.7695 49.8683 50.0061 6.0360 3.7424 25.4063 0.4392 19.6776 14.3955 13.2967 9.3587 5.9104 9.4640 13.0415 24.6466 16.0020 14.5248 89.7230 2.8909 11.4084 144.9755 302.9047 25.3478 33.8041 11.6091 3.5030 0.3368 2.7865 35.0198 4.6350 33.4785 36.6740 37.3345 0.4171 9.4837 11.8635 18.9819 29.8847 32.5169 30.2191 57.8903
temp: 298.150 k
press: 1.00000 atm
elementType: 16 8 8 8 7 6 6 6 6 6 6 6 6 6 6 6 6 6 6 1 1 1 1 1 1 1 1 1 1 1 1 1 1 1 1 1 1 1
symmnumber: 1
zpe: 804038.9 jmol-1
zpe.correction: 0.306242 hartree
zpe.thermalcorrener: 0.326887 hartree
zpe.thermalcorrenthalpy: 0.327831 hartree
zpe.thermalcorrgfe: 0.256252 hartree
zpe.sumelectzpe: -1221.959788 hartree
zpe.sumelectthermal: -1221.939143 hartree
zpe.sumelectthermalent: -1221.938199 hartree
zpe.sumelectthermalfe: -1222.009779 hartree
dipole: 0.5649 -1.6582 -0.2555
dipole: 1.7703
quadrupole: -112.5737 -117.2068 -123.1135
quadrupole: 0.6071 6.3701 -3.2380
quadrupole: 5.0577 0.4245 -5.4822 0.6071 6.3701 -3.2380
hfenergy: -1222.2660305 hartree
pointgroup: C01 [X(C14H19N1O3S1)]
dipole: -0.1981891 0.6213601 -0.2443739 debye
polarizability: 239.0831343|-1.9497428|168.0088305|4.5376011|-18.2675652|146.096131 unknown
InChI: InChI=1S/C14H19NO3S/c1-3-11(12(16)17)19-14(4-2,13(15)18)10-8-6-5-7-9-10/h5-9,11,16H,3-4,15H2,1-2H3
charge 0 multiplicity 1
38 atoms
S  -0.699956 0.784798 -0.910248
O  0.373073 -2.486305 1.248669
O  -2.839115 -1.269092 1.085514
O  -3.506826 -1.277459 -1.143021
N  -0.227761 -2.195471 -0.969021
C  0.412934 -0.176132 0.373943
C  0.116294 0.278172 1.832876
C  1.886354 0.11369 -0.01201
C  -2.466292 0.748977 -0.159946
C  0.161645 -1.718445 0.25987
C  -3.327099 1.694637 -1.023292
C  0.333113 1.776347 2.111379
C  2.896377 -0.777819 0.444282
C  2.282352 1.268662 -0.734242
C  -2.998011 -0.675166 -0.172666
C  -4.747115 1.879425 -0.441301
C  4.257489 -0.526132 0.169163
C  3.646083 1.515571 -1.01333
C  4.641091 0.619731 -0.565271
H  -0.910999 -0.030511 2.098546
H  0.779819 -0.327318 2.477948
H  -2.387196 1.108511 0.877823
H  -3.393512 1.284446 -2.047757
H  -2.814709 2.672649 -1.086164
H  0.108353 1.996242 3.170828
H  1.377058 2.078733 1.916471
H  -0.320128 2.410011 1.482986
H  2.613847 -1.667518 1.017271
H  1.528482 1.984742 -1.076993
H  -4.712739 2.284011 0.587286
H  -5.299939 0.92325 -0.420216
H  -5.324973 2.585577 -1.06358
H  5.01816 -1.228047 0.529177
H  3.926611 2.411936 -1.57798
H  -0.327744 -3.202596 -1.092066
H  -0.466114 -1.552745 -1.727504
H  5.697917 0.811353 -0.781905
H  -3.106224 -2.22761 1.051584
