program: Gaussian 09
title: 000023228
version: EM64L-G09RevD.01
frameworkgroup: C1[X(C6H14N2O2)]
method: RPBEPBE
basis: SDD
operation: Freq
keyword: #p
keyword: freq=noraman
keyword: PBEPBE/SDD
title: #p freq=noraman PBEPBE/SDD
converged: YES YES NO NO
title: Mulliken charges:
elementType: O O N N C C C C C C H H H H H H H H H H H H H H
charge: -0.305804 -0.292611 -0.093123 -0.361775 -0.333231 -0.614786 -0.612186 0.294703 -0.216763 -0.674783 0.236431 0.221545 0.326144 0.224902 0.197611 0.240752 0.226686 0.224091 0.195352 0.225563 0.225051 0.209860 0.227924 0.228447
chargesum: 0.00000
title: Mulliken charges with hydrogens summed into heavy atoms:
elementType: O O N N C C C C C C
charge: -0.305804 -0.292611 -0.093123 -0.035631 0.124745 0.048479 0.033943 0.294703 0.233851 -0.008552
polarizability: 1.18273455e+02 -1.61547888e+00 7.39172622e+01 4.15487185e+00 2.97909638e+00 7.43917233e+01
1716.lowfreq: -10.6467 -6.9674 0.0008 0.0009 0.0010 3.4707 29.4154 36.9111 62.8358
frequency: 29.3146 36.9033 62.8244 70.4303 117.3852 151.2512 221.7567 227.2150 247.9876 259.1235 281.1827 308.4619 345.7170 368.3771 430.6898 531.8056 617.9356 676.5635 698.6426 800.1690 800.5608 842.2500 930.7950 1017.9135 1030.3960 1038.7982 1053.6521 1090.2163 1107.7107 1123.4372 1138.4798 1143.5715 1192.9748 1198.6316 1247.5614 1269.8507 1287.7436 1354.5960 1381.4784 1398.8839 1418.2803 1441.4964 1460.2476 1462.6569 1468.3342 1473.4144 1477.5244 1480.5120 1485.8180 1490.7881 1495.5752 1662.9981 2868.4382 2882.5101 2925.7532 2994.4513 3005.6942 3007.5194 3020.0940 3033.8918 3062.6219 3077.9290 3091.3818 3091.5325 3104.8392 3564.6347
redmass: 2.3297 3.3872 2.9814 3.7446 3.1948 3.0467 1.0888 1.1943 1.2035 2.9245 3.3316 3.3813 2.6905 2.6979 2.4385 2.4272 1.3387 5.7789 11.5602 1.2442 2.8914 3.3264 3.6643 2.1977 2.3112 1.5429 2.0483 1.2915 2.6633 2.6463 1.4593 1.8161 1.8701 2.2569 1.1349 2.6620 1.5204 1.3125 1.2713 1.2626 1.1396 1.1664 1.0590 1.0408 1.0580 1.2184 1.0515 1.1050 1.2017 1.0548 1.2954 9.4592 1.0557 1.0551 1.0639 1.0357 1.0582 1.0968 1.0740 1.0756 1.1068 1.1008 1.1003 1.0987 1.1024 1.0771
irintensity: 0.1502 0.8432 1.9820 8.2193 4.5990 3.8274 1.0625 2.3476 0.6803 4.2393 6.3678 9.6009 6.6995 4.7239 1.9702 32.1413 109.8869 11.2919 20.1512 7.7474 4.5141 9.9111 71.4009 91.5561 120.2318 3.3549 85.5772 6.5607 35.9840 36.0425 4.4331 32.5791 154.8989 147.7312 0.0626 8.3477 66.2729 5.9785 11.3859 31.1510 7.2272 7.6164 32.7376 11.3656 3.3338 153.2611 4.4784 3.8013 103.8105 13.8269 124.1995 281.1612 90.4463 133.6901 54.2418 22.9906 29.4387 39.2947 42.9943 40.4661 11.3320 32.0482 45.1178 20.3499 48.9878 35.3638
temp: 298.150 k
press: 1.00000 atm
elementType: 8 8 7 7 6 6 6 6 6 6 1 1 1 1 1 1 1 1 1 1 1 1 1 1
symmnumber: 1
zpe: 536418.5 jmol-1
zpe.correction: 0.204311 hartree
zpe.thermalcorrener: 0.216946 hartree
zpe.thermalcorrenthalpy: 0.217890 hartree
zpe.thermalcorrgfe: 0.163985 hartree
zpe.sumelectzpe: -496.153071 hartree
zpe.sumelectthermal: -496.140437 hartree
zpe.sumelectthermalent: -496.139493 hartree
zpe.sumelectthermalfe: -496.193397 hartree
dipole: -0.6871 -1.1789 -0.9850
dipole: 1.6829
quadrupole: -48.0472 -65.0038 -62.4692
quadrupole: -2.4224 0.1598 -4.3209
quadrupole: 10.4595 -6.4970 -3.9625 -2.4224 0.1598 -4.3209
hfenergy: -496.3573824 hartree
pointgroup: C01 [X(C6H14N2O2)]
dipole: -0.2874607 0.4376852 0.40519 debye
dipolederiv: -1.782812 -0.3297782 -0.0026752 -0.5646073 -0.5180609 -0.0926387 -0.1377547 -0.1337501 -0.4167823 -0.7517404 -0.0108137 0.0547257 -0.0052806 -0.655288 -0.3270231 0.1160677 -0.3465265 -0.7344683 -0.8035947 -0.060104 -0.0129743 0.1561148 -0.536864 0.0117944 -0.0677808 -0.0120673 -0.5633254 -1.567214 0.1235023 0.2313118 0.1050243 -0.4213147 0.0670568 0.3033301 0.0197452 -0.5368916 1.2147681 -0.1686505 0.0382179 -0.0063859 0.4849588 -0.0619287 0.3189388 -0.0337257 0.328189 0.0254648 0.0417238 0.0113945 0.028891 0.2765248 -0.0159157 0.0838548 0.0030478 0.460486 0.4997092 0.1434457 0.0031461 0.1820169 0.2304484 0.1142536 -0.0583128 0.1156472 0.2356787 2.3316267 0.177386 -0.2957819 0.3294239 0.8401291 0.5153664 -0.3270599 0.5890273 0.9874441 0.9952647 0.0938664 -0.0650071 -0.0234525 0.3129115 -0.0559331 -0.23651 -0.0897476 0.3196845 -0.0927037 -0.0810186 -0.0449622 -0.0712836 0.0121578 -0.0325476 -0.0263837 -0.0313823 0.0446571 0.0137314 0.05437 -0.0137923 0.0456166 -0.0448784 -0.0453167 -0.004193 -0.1477489 -0.0287327 -0.0974468 -0.0554101 0.0798163 -0.0491753 -0.0102131 0.0950242 0.070695 0.1294458 -0.0733664 0.189799 -0.0272375 0.0440991 -0.1161839 0.2417779 -0.0975238 0.0207793 -0.0865073 0.2578107 -0.0084782 0.1668744 -0.0393705 0.1329815 -0.0803755 0.0304933 -0.0009554 0.0062582 0.0544935 0.0600484 -0.0321403 -0.0676111 -0.0570831 -0.0572927 -0.1769869 -0.0545385 -0.0187618 -0.2157674 -0.0987011 -0.1135116 0.059855 -0.0990284 0.0926694 -0.0027026 0.0368012 -0.001251 0.0569966 -0.0666873 0.0869127 0.0012121 0.1585412 -0.0739424 -0.0034803 -0.0507828 0.0095337 0.1079353 0.084052 -0.0159014 -0.0117218 -0.0817528 0.0449726 0.1144731 0.0521087 0.1007954 -0.1334886 -0.1082852 -0.0653377 0.0056128 -0.1951298 -0.0910968 -0.1204325 -0.1406349 -0.1743016 -0.0781782 -0.0524721 -0.0024957 0.0096192 0.0843391 -0.1330828 0.0026474 0.0487056 0.0329942 0.0614907 -0.0450685 -0.0089682 -0.0490394 0.0172341 0.0596146 0.0414892 0.0498624 0.0449829 -0.1357721 -0.1426427 0.0027063 0.0851783 0.0176902 0.0925351 -0.0320805 0.1083632 -0.0250946 0.0483003 0.0940194 0.0826362 -0.0117972 0.0231527 -0.1384558 0.0110336 -0.0351154 0.0152946 0.090139 0.1093631 -0.0020563 -0.0094559 -0.0116628 0.0721651 0.0608782 -0.0694848 0.0340923 -0.1365324 unknown
polarizability: 118.1699264|3.2021465|73.8214847|-3.8611415|2.8378413|74.5910291 unknown
InChI: InChI=1S/C6H14N2O2/c1-4-10-6(9)7-5-8(2)3/h7H,4-5H2,1-3H3
charge 0 multiplicity 1
24 atoms
O  1.898112 0.304483 0.385857
O  0.863676 -1.25469 -1.053492
N  -2.626229 0.366622 0.159022
N  -0.313441 -0.137998 0.657356
C  -1.635448 -0.704772 0.38955
C  -2.434574 1.067733 -1.127535
C  -4.017516 -0.078287 0.370002
C  0.801969 -0.443404 -0.092189
C  3.18304 0.064488 -0.326742
C  4.22233 0.966791 0.332162
H  -1.509382 -1.398581 -0.473065
H  -1.984045 -1.293997 1.260133
H  -0.229355 0.570675 1.387894
H  -3.082918 1.961187 -1.162152
H  -2.668968 0.427533 -2.013484
H  -1.386603 1.401042 -1.213996
H  -4.693148 0.793303 0.308411
H  -4.122816 -0.519238 1.377809
H  -4.367108 -0.832905 -0.378179
H  3.441146 -1.00684 -0.240173
H  3.042996 0.296863 -1.39824
H  5.20273 0.829671 -0.159639
H  3.934587 2.028568 0.244294
H  4.333265 0.723354 1.402797
