program: Gaussian 09
title: 000257070
version: EM64L-G09RevD.01
frameworkgroup: C1[X(C23H17NO3)]
method: RPBEPBE
basis: SDD
operation: Freq
keyword: #p
keyword: freq=noraman
keyword: PBEPBE/SDD
title: #p freq=noraman PBEPBE/SDD
converged: YES YES NO NO
title: Mulliken charges:
elementType: O O O N C C C C C C C C C C C C C C C C C C C C C C C H H H H H H H H H H H H H H H H H
charge: -0.254116 -0.202176 -0.207454 -0.350334 0.033303 0.084183 0.097301 0.098827 0.358555 0.471862 -0.416367 -0.373792 -0.385734 -0.350045 -0.351187 0.474780 -0.241453 -0.240734 -0.222215 -0.222536 -0.242437 -0.391514 -0.380669 -0.243726 -0.224934 -0.225354 -0.228177 0.244355 0.238728 0.288626 0.290829 0.268188 0.263906 0.227092 0.226693 0.229085 0.228321 0.228920 0.237107 0.237069 0.230238 0.231806 0.231630 0.233551
chargesum: 0.00000
title: Mulliken charges with hydrogens summed into heavy atoms:
elementType: O O O N C C C C C C C C C C C C C C C C C C C C C C C
charge: -0.254116 -0.202176 -0.207454 -0.350334 0.033303 0.084183 0.097301 0.098827 0.358555 0.471862 0.066715 -0.085166 -0.094905 -0.081857 -0.087281 0.474780 -0.014361 -0.014041 0.006871 0.005785 -0.013517 -0.154407 -0.143601 -0.013488 0.006872 0.006276 0.005374
polarizability: 3.85659868e+02 -2.65908597e+01 3.20439689e+02 4.33305342e+00 8.71451457e+00 1.57028999e+02
1716.lowfreq: -7.5220 -3.5731 -0.0004 -0.0002 0.0006 4.3212 7.7481 12.0974 30.7955
frequency: 7.5325 11.1641 30.7686 36.1271 37.7449 46.1681 64.4042 70.8164 92.4347 116.6703 144.5320 159.1684 179.6004 218.6899 242.4261 262.4876 296.8626 305.3350 324.4020 328.7144 347.2117 383.6967 401.2965 403.0136 404.7287 428.2049 452.2102 502.0354 507.9379 549.6679 557.3579 608.1542 612.5597 616.5781 617.2357 622.1079 653.5170 691.7404 698.8099 702.7568 718.4217 741.3295 744.6485 756.3640 777.3978 789.4049 791.1976 814.8731 835.9555 849.3637 854.0049 863.4135 911.2000 916.8504 932.5098 941.0439 944.6487 968.9737 978.7638 987.9434 989.5882 991.0770 991.6376 995.5281 1000.7502 1005.7921 1026.2128 1026.7678 1029.8808 1037.7074 1063.9504 1088.3992 1098.2371 1106.0844 1138.9801 1174.3890 1174.8616 1175.6573 1180.5251 1188.7834 1194.6078 1207.6644 1229.7685 1240.7695 1301.5844 1326.6533 1327.4658 1335.2075 1348.9331 1363.3380 1375.6967 1383.1642 1386.5673 1438.4970 1441.0278 1443.4878 1453.8270 1483.9682 1487.0844 1488.5416 1571.2657 1590.0831 1596.2324 1602.7915 1606.9546 1611.0582 1613.5168 1616.8132 1660.7573 3031.7023 3104.6310 3124.7874 3125.8603 3126.7145 3131.6809 3138.3751 3138.6028 3144.2162 3151.8166 3157.4558 3162.0116 3167.2529 3179.8007 3184.0838 3188.0225 3189.8218
redmass: 3.7466 5.0554 3.8683 5.6797 4.8148 4.3142 6.3608 5.4118 6.8517 5.5714 7.8367 6.0994 6.4881 5.2621 5.9107 6.0860 6.5157 5.2015 9.8406 2.3019 8.8199 6.5257 2.7925 2.8931 2.8418 7.2743 5.1102 4.0961 3.4095 7.2619 5.1983 9.0312 6.5432 6.3377 6.9571 6.2882 6.8929 1.9704 1.8354 1.7634 7.1900 4.3902 3.2669 2.0099 4.0251 2.4573 3.6912 6.1258 1.2599 4.0346 1.2472 1.2441 1.4443 6.2593 1.5893 1.6219 1.4272 1.3916 1.3933 6.2386 6.0132 6.1454 1.3275 1.3684 1.3252 1.3162 2.3529 2.5754 2.5383 4.0298 3.2306 1.5271 1.7098 2.0397 4.1794 1.0562 1.0488 1.0580 1.0712 1.1153 1.1266 1.1350 2.4933 6.3942 2.3971 1.2763 1.3183 1.3848 5.6703 2.0634 6.1022 9.0331 8.7745 2.4503 2.1915 2.3236 1.1107 2.2485 2.3950 2.3861 5.4880 6.6731 6.1280 9.7403 7.6672 6.0948 7.3678 6.2617 12.1644 1.0579 1.1088 1.0856 1.0853 1.0886 1.0854 1.0920 1.0907 1.0906 1.0963 1.0973 1.0969 1.1017 1.0948 1.0951 1.0949 1.0966
irintensity: 0.0660 0.0484 0.0082 0.1755 0.8999 2.1125 0.6941 0.4622 0.1137 1.0895 2.8084 0.3700 1.9944 0.2654 3.1537 3.1400 3.0124 1.2414 10.2265 0.5844 0.1838 0.3747 0.0233 0.0062 0.8683 6.2859 7.9379 12.7316 5.6996 8.0397 5.2925 31.0078 0.4753 0.0832 3.4582 13.7125 9.8118 31.0871 47.9461 48.0025 4.3537 22.4801 138.5125 38.8316 13.0163 52.8737 21.7347 57.8773 0.2899 16.2547 0.0027 0.2089 4.3445 92.3400 1.1885 0.7063 8.3230 0.0092 0.0082 0.2705 0.5327 1.3663 0.2470 0.0949 0.0385 0.9932 7.6681 0.8668 20.1001 9.1461 33.5293 6.7719 19.0253 5.0171 118.2564 0.1080 0.1247 0.7947 2.7014 4.4265 1.1493 14.1072 27.4409 153.4901 399.3402 0.8626 0.8463 41.7979 596.7454 56.9347 7.6361 0.6447 0.8652 14.9751 9.7127 19.7292 19.0638 58.0207 18.4839 121.9000 2.5154 106.9071 0.7227 242.1820 107.8004 44.1359 165.6215 4.9238 22.9746 15.1171 7.9480 4.4432 0.0381 2.3630 0.1203 12.5202 23.5653 17.9203 34.2515 35.8309 40.8962 21.1531 12.7992 4.2477 10.4642 0.8303
temp: 298.150 k
press: 1.00000 atm
elementType: 8 8 8 7 6 6 6 6 6 6 6 6 6 6 6 6 6 6 6 6 6 6 6 6 6 6 6 1 1 1 1 1 1 1 1 1 1 1 1 1 1 1 1 1
symmnumber: 1
zpe: 882330.6 jmol-1
zpe.correction: 0.336062 hartree
zpe.thermalcorrener: 0.358543 hartree
zpe.thermalcorrenthalpy: 0.359487 hartree
zpe.thermalcorrgfe: 0.279080 hartree
zpe.sumelectzpe: -1165.225072 hartree
zpe.sumelectthermal: -1165.202590 hartree
zpe.sumelectthermalent: -1165.201646 hartree
zpe.sumelectthermalfe: -1165.282053 hartree
dipole: -3.0003 -1.3445 0.0087
dipole: 3.2878
quadrupole: -129.4644 -153.7631 -151.3777
quadrupole: -2.0874 1.6689 3.7141
quadrupole: 15.4040 -8.8947 -6.5093 -2.0874 1.6689 3.7141
hfenergy: -1165.5611335 hartree
pointgroup: C01 [X(C23H17N1O3)]
dipole: 1.1552876 0.5814946 -0.0181373 debye
polarizability: 385.4266858|-21.5359635|317.6440569|-25.7200382|13.3454412|160.0578135 unknown
InChI: InChI=1S/C23H17NO3/c25-22-20(18-12-6-2-7-13-18)21(27-16-17-10-4-1-5-11-17)23(26)24(22)19-14-8-3-9-15-19/h1-15H,16H2
charge 0 multiplicity 1
44 atoms
O  1.402464 0.512023 0.080055
O  -2.625714 -2.158273 -0.048469
O  -1.076387 2.243033 0.515588
N  -2.228963 0.162175 0.289594
C  -0.315773 -1.223953 -0.066212
C  0.099218 0.091225 0.101662
C  -1.813634 -1.20704 0.046638
C  -1.088442 0.997561 0.325626
C  0.488357 -2.4300 -0.310969
C  -3.588412 0.600165 0.460916
C  1.756495 1.984117 0.220077
C  -0.128217 -3.7055 -0.501415
C  1.915948 -2.356102 -0.366618
C  -4.509317 -0.20999 1.171241
C  -4.00174 1.844194 -0.078514
C  3.256359 2.072469 0.117496
C  0.653356 -4.853791 -0.73659
C  2.687203 -3.510998 -0.602461
C  -5.841999 0.225616 1.329256
C  -5.333374 2.274365 0.101031
C  2.064206 -4.767264 -0.789234
C  4.058807 2.045337 1.285994
C  3.884189 2.182174 -1.149227
C  -6.260478 1.468078 0.800352
C  5.465833 2.125715 1.191657
C  5.290686 2.261142 -1.247265
C  6.083988 2.233689 -0.076116
H  1.37165 2.334246 1.191747
H  1.239443 2.531673 -0.585512
H  -1.217313 -3.783388 -0.463985
H  2.411578 -1.39364 -0.223297
H  -4.190911 -1.171004 1.580682
H  -3.288368 2.471432 -0.6181
H  0.15804 -5.820587 -0.880459
H  3.779413 -3.429811 -0.639975
H  -6.551751 -0.407226 1.873018
H  -5.645901 3.239387 -0.312518
H  2.667956 -5.663157 -0.97261
H  3.579867 1.959251 2.268799
H  3.270013 2.202733 -2.057584
H  -7.29488 1.80356 0.931613
H  6.077282 2.106196 2.100345
H  5.766779 2.34725 -2.230066
H  7.175244 2.298722 -0.150787
