program: Gaussian 09
title: 000257065
version: EM64L-G09RevD.01
frameworkgroup: C1[X(C17H26N2O4)]
method: RPBEPBE
basis: SDD
operation: Freq
keyword: #p
keyword: freq=noraman
keyword: PBEPBE/SDD
title: #p freq=noraman PBEPBE/SDD
converged: YES YES NO NO
title: Mulliken charges:
elementType: O O O O N N C C C C C C C C C C C C C C C C C H H H H H H H H H H H H H H H H H H H H H H H H H H
charge: -0.298955 -0.296741 -0.316996 -0.316249 -0.361977 -0.371011 0.287708 -0.403587 -0.568428 -0.509267 0.451709 -0.725397 -0.374548 -0.384544 -0.267160 -0.263936 -0.245972 0.291544 0.286790 -0.253781 -0.214244 -0.662714 -0.676778 0.220553 0.197651 0.232629 0.278662 0.249273 0.228258 0.250028 0.220008 0.202836 0.322438 0.377867 0.251845 0.223795 0.229527 0.221730 0.227182 0.221972 0.239223 0.224277 0.220272 0.249188 0.224820 0.218449 0.227481 0.229313 0.205258
chargesum: 0.00000
title: Mulliken charges with hydrogens summed into heavy atoms:
elementType: O O O O N N C C C C C C C C C C C C C C C C C
charge: -0.298955 -0.296741 -0.316996 -0.316249 -0.039539 0.006856 0.287708 0.014617 -0.057137 -0.031736 0.451709 -0.052525 -0.122703 -0.160749 -0.037633 -0.042206 -0.018790 0.291544 0.286790 0.207413 0.230305 0.029743 -0.014726
polarizability: 2.50990999e+02 3.65886340e+00 2.06250613e+02 -6.11480499e+00 4.56968278e+00 1.71714276e+02
1716.lowfreq: -18.8768 -9.4721 -7.7098 -0.0005 0.0004 0.0006 7.1547 25.0923 28.3870
frequency: -16.5362 24.8953 28.2639 33.9605 44.0007 51.9264 58.3914 69.7943 87.1755 92.7667 102.2201 119.5143 130.7388 144.3346 162.0024 171.5265 198.8853 225.5741 230.0892 249.6009 253.5678 264.8658 281.6956 298.4453 310.8662 341.3263 360.4997 363.1131 396.7943 400.7474 403.8149 476.6371 514.7535 530.2825 569.9760 581.7725 615.0827 621.4047 636.4699 668.5280 695.1924 697.4465 701.8674 717.1879 761.6553 770.7866 784.4138 787.8343 800.9025 808.9320 823.2325 842.3506 855.2880 875.2670 906.5750 930.3336 938.2263 969.3253 983.8870 989.3453 994.3265 1014.5306 1026.8651 1028.8963 1037.1480 1049.1433 1090.8131 1095.0852 1096.0400 1108.3493 1113.6138 1121.5466 1136.7878 1139.6018 1156.1905 1171.1223 1176.9794 1201.5258 1207.3204 1214.6322 1223.6928 1247.6839 1255.0791 1281.1015 1282.8769 1306.8539 1327.7282 1335.0976 1356.2853 1356.7890 1359.8966 1366.6453 1376.2912 1390.9647 1394.6469 1397.6336 1433.8526 1456.3603 1460.9589 1461.9663 1462.5350 1464.1663 1476.1786 1477.1546 1483.3886 1484.6775 1487.0055 1488.6203 1490.6828 1501.9516 1509.6773 1588.2670 1613.2232 1647.6560 1651.1175 2964.5844 2977.2178 2991.3196 2991.7316 2992.8838 3002.8440 3018.5576 3021.4586 3031.4911 3059.4825 3064.4195 3075.1869 3081.1583 3084.3299 3087.2452 3089.6502 3091.7536 3104.1354 3118.3538 3121.6260 3133.1911 3147.6881 3156.3007 3167.6677 3428.8357 3566.4026
redmass: 3.8161 3.0796 3.4603 3.8069 3.3619 3.2855 2.8790 2.5593 5.0955 4.2316 5.7096 4.7452 2.7479 4.4889 4.7169 2.8472 2.0709 2.4800 1.7520 1.7852 1.6654 4.4498 1.8333 2.8668 3.2679 3.1500 2.4715 3.4392 2.8126 2.7832 3.4588 3.4083 3.2371 3.7834 1.2289 2.7712 3.9873 3.8902 4.5908 5.3714 8.1500 1.6498 9.5584 3.7580 1.6929 1.1847 1.5819 1.6464 1.0940 1.7001 2.5649 1.2674 2.9572 2.4783 1.5610 3.1136 3.2855 1.4187 1.9123 2.4481 1.9134 2.8835 2.7139 2.2852 2.1474 2.8583 1.7304 2.1037 2.0342 2.7261 3.1783 4.0996 3.8860 1.4901 1.6876 2.1057 1.2478 1.9612 1.7976 1.5997 2.1073 1.1337 1.1943 1.1264 1.1990 1.3025 1.4077 1.4046 1.3036 1.2834 1.3331 1.3490 4.4471 1.2356 1.2165 1.2691 2.2560 1.0997 1.1131 1.0411 1.1089 1.0561 1.1056 1.0614 1.0708 1.0771 1.0613 1.4012 1.3679 1.6543 1.7316 5.6147 5.8901 6.7181 9.1334 1.0609 1.0383 1.0659 1.0361 1.0360 1.0578 1.0638 1.0928 1.0595 1.1068 1.0981 1.0945 1.1035 1.0998 1.0972 1.0985 1.1032 1.1022 1.1065 1.0846 1.0881 1.0922 1.0950 1.0997 1.0798 1.0773
irintensity: 0.0654 0.1413 0.2046 0.6252 1.0513 0.6302 0.6669 0.1598 0.3259 6.0132 3.2534 10.7475 1.2533 2.2999 0.8482 0.2368 3.1674 2.4887 6.5348 3.0734 2.8694 1.4733 0.2913 5.4158 13.4673 12.1441 7.3160 8.6577 0.8387 0.2309 11.5340 4.7715 2.0414 13.0736 97.1666 4.6881 6.1664 8.1501 4.8096 5.7363 11.1076 67.5194 21.6625 10.1614 37.6130 73.5919 54.6785 19.1246 7.0094 5.0989 8.7078 0.9755 7.0714 17.3156 10.5156 27.9122 48.0353 0.0367 41.7529 0.1293 0.2980 105.5954 16.2639 12.2211 27.6017 94.1451 7.7645 13.6718 21.6106 35.9640 73.8055 43.5579 119.2299 7.6907 41.1398 25.2956 11.2138 22.9556 211.9728 70.8835 173.9124 0.1419 86.6384 8.4978 88.3226 47.3746 2.8182 0.8974 2.3011 4.6071 1.9116 1.1894 1.0342 27.7248 21.0551 26.2184 7.2505 17.8445 8.2521 12.0765 19.8552 8.5946 57.2654 19.9268 11.4306 8.7646 9.6201 113.6228 126.8846 188.7849 376.3980 2.4664 3.8201 212.9869 195.3712 32.0898 30.2656 59.4407 19.3828 21.9359 28.4505 20.7857 26.0609 36.2369 12.7335 51.2254 14.8050 8.5094 36.0936 38.4293 35.6171 1.1592 46.4648 35.6651 1.4012 6.6320 38.2643 29.5173 9.1865 260.3501 33.6244
temp: 298.150 k
press: 1.00000 atm
elementType: 8 8 8 8 7 7 6 6 6 6 6 6 6 6 6 6 6 6 6 6 6 6 6 1 1 1 1 1 1 1 1 1 1 1 1 1 1 1 1 1 1 1 1 1 1 1 1 1 1
symmnumber: 1
zpe: 1079062.1 jmol-1
zpe.correction: 0.410993 hartree
zpe.thermalcorrener: 0.435349 hartree
zpe.thermalcorrenthalpy: 0.436294 hartree
zpe.thermalcorrgfe: 0.355049 hartree
zpe.sumelectzpe: -1072.066941 hartree
zpe.sumelectthermal: -1072.042584 hartree
zpe.sumelectthermalent: -1072.041640 hartree
zpe.sumelectthermalfe: -1072.122885 hartree
dipole: -2.6337 -2.4898 -0.6580
dipole: 3.6836
quadrupole: -122.0118 -128.5062 -139.2780
quadrupole: 1.5762 -6.0586 -0.6538
quadrupole: 7.9202 1.4258 -9.3460 1.5762 -6.0586 -0.6538
hfenergy: -1072.4779339 hartree
pointgroup: C01 [X(C17H26N2O4)]
dipole: 1.1527108 -0.8149906 0.3275479 debye
polarizability: 251.3640363|2.4046443|205.4629515|-3.7122196|-7.0186374|172.1289005 unknown
InChI: InChI=1S/C17H26N2O4/c1-4-17(12-18-15(20)22-5-2,13-19-16(21)23-6-3)14-10-8-7-9-11-14/h7-11,18-19H,4-6,12-13H2,1-3H3
charge 0 multiplicity 1
49 atoms
O  4.446864 -0.415991 0.560147
O  -0.855228 3.123408 -0.037894
O  2.571566 0.927167 1.052733
O  -1.695927 1.808537 -1.805515
N  2.390278 -1.380542 0.654728
N  0.092289 1.096163 -0.446559
C  0.019602 -1.459975 -0.309829
C  0.340902 -2.670183 -1.258265
C  0.951496 -1.48526 0.946308
C  0.323579 -0.168163 -1.144466
C  -1.464285 -1.525743 0.126107
C  0.188763 -4.074279 -0.635935
C  -2.491378 -1.189779 -0.797963
C  -1.866259 -1.976703 1.412501
C  -3.855137 -1.307833 -0.456703
C  -3.231604 -2.094691 1.76013
C  -4.236339 -1.765681 0.825116
C  3.079259 -0.198629 0.776412
C  -0.884189 1.972472 -0.851282
C  5.309388 0.802241 0.593474
C  -1.874914 4.152767 -0.371931
C  5.329166 1.499948 -0.7691
C  -1.684473 5.291828 0.625989
H  -0.329782 -2.596322 -2.136664
H  1.373448 -2.545687 -1.646666
H  0.800107 -2.421772 1.509465
H  0.68359 -0.647136 1.613259
H  -0.291433 -0.157274 -2.059652
H  1.381788 -0.219676 -1.467775
H  -0.825259 -4.220788 -0.224138
H  0.360695 -4.852889 -1.401171
H  0.913833 -4.254708 0.180433
H  2.931564 -2.216737 0.432638
H  0.771918 1.3828 0.271312
H  -2.238609 -0.794111 -1.786292
H  -1.123637 -2.240043 2.171942
H  -4.618382 -1.027734 -1.191229
H  -3.505821 -2.443008 2.762685
H  -5.295396 -1.855102 1.091824
H  6.299447 0.406145 0.870738
H  4.933942 1.475367 1.383778
H  -2.878446 3.694758 -0.299976
H  -1.723168 4.480078 -1.417072
H  4.331915 1.900036 -1.018626
H  5.648424 0.804686 -1.564758
H  6.041129 2.34593 -0.743965
H  -0.670545 5.720041 0.544794
H  -1.828269 4.934694 1.660208
H  -2.419769 6.093171 0.427208
