program: Gaussian 09
title: 000257062
version: EM64L-G09RevD.01
frameworkgroup: C1[X(C10H20N2O)]
method: RPBEPBE
basis: SDD
operation: Freq
keyword: #p
keyword: freq=noraman
keyword: PBEPBE/SDD
title: #p freq=noraman PBEPBE/SDD
converged: YES YES NO NO
title: Mulliken charges:
elementType: O N N C C C C C C C C C C H H H H H H H H H H H H H H H H H H H H
charge: -0.312628 -0.373887 -0.368232 0.348232 -0.451120 -0.431764 -0.421569 -0.400591 -0.748035 -0.346716 0.149500 -0.359437 -0.695257 0.198976 0.194641 0.218505 0.227406 0.220191 0.217056 0.207206 0.203138 0.208069 0.250614 0.213823 0.188009 0.188510 0.321943 0.323597 0.196041 0.195332 0.210416 0.217547 0.210484
chargesum: 0.00000
title: Mulliken charges with hydrogens summed into heavy atoms:
elementType: O N N C C C C C C C C C C
charge: -0.312628 -0.051944 -0.044635 0.348232 -0.057503 0.014147 0.015677 0.009753 -0.075528 0.029804 0.149500 0.031936 -0.056810
polarizability: 1.59937438e+02 1.43559998e+00 1.11791572e+02 -2.06677607e+00 -1.71531940e+00 9.65841753e+01
1716.lowfreq: -3.5729 -0.0007 -0.0005 0.0004 10.9100 12.9523 40.5499 46.7677 66.9654
frequency: 40.5124 46.2743 66.9414 95.1909 113.5374 125.4076 132.6197 169.3178 205.4118 224.9024 234.0262 240.4832 305.9670 333.7490 365.2064 402.9462 435.2421 463.0818 481.8612 531.9629 561.6534 567.0767 704.8617 710.6683 726.5461 748.2647 780.7232 828.9089 855.1241 889.6688 920.2801 922.4470 937.4532 965.1216 1005.4853 1012.1586 1048.5508 1057.7459 1076.2078 1082.1448 1111.9952 1149.9680 1176.2620 1183.2546 1198.6084 1211.3052 1231.4826 1254.0736 1267.0645 1275.3475 1289.8810 1294.2322 1308.4499 1330.6624 1347.6570 1350.6096 1355.9094 1388.9079 1391.2227 1403.2967 1409.6205 1442.2138 1455.1054 1463.0870 1469.2787 1472.1459 1478.0033 1478.9974 1481.7285 1487.1062 1494.6936 1498.8825 1656.3482 2922.2508 2932.4145 2946.3168 2952.9194 2964.0467 2972.5836 2972.7128 2983.1825 2991.5174 2996.4112 3018.0523 3022.0720 3028.8556 3043.4106 3069.2890 3072.4753 3074.3505 3091.9988 3582.2968 3586.0125
redmass: 2.9356 1.9075 4.0255 3.6914 1.9520 2.2311 2.7872 1.7436 1.6767 3.7496 1.1406 3.2492 2.5156 2.3433 3.1341 2.1356 3.5703 2.7663 1.2757 2.2421 1.3335 5.4195 3.9871 8.2953 1.0720 1.1535 4.9180 1.2772 2.7540 1.8861 1.7130 1.5535 1.7331 1.5736 1.7341 3.2048 2.2720 2.1699 2.3424 1.6079 2.2087 2.6188 1.8945 2.1650 1.8710 1.4480 1.3350 1.3895 1.4280 1.5935 1.1122 1.1624 1.4006 1.5623 1.5604 1.4825 1.5289 1.2167 1.3294 1.5321 1.3804 1.8614 1.0795 1.0718 1.0747 1.0588 1.0449 1.0712 1.0647 1.0857 1.0833 1.4251 4.4223 1.0684 1.0673 1.0593 1.0588 1.0595 1.0516 1.0442 1.0375 1.0962 1.1001 1.1020 1.0951 1.0941 1.1041 1.1008 1.0993 1.0983 1.0988 1.0764 1.0783
irintensity: 1.0625 0.2660 1.2224 0.2496 0.0388 0.1198 0.0833 0.5813 1.7248 1.9962 0.2155 10.7197 0.6791 1.3666 3.4987 0.6400 6.2075 6.7337 4.2401 59.1958 147.0395 2.3930 13.0515 47.2722 12.1531 0.1373 1.6744 2.3104 1.9238 7.2958 1.7254 4.4048 0.7097 1.0206 2.6662 2.8492 18.4876 4.5251 0.5328 4.4297 17.3213 65.2649 3.9376 0.5447 0.6721 1.5309 8.6761 1.0603 15.5541 95.3865 0.6240 1.4608 0.8982 3.8600 3.4392 2.2020 2.2893 12.8304 18.2584 25.5396 5.6415 59.8723 6.1103 0.3841 0.1313 9.1087 11.3136 5.4751 3.8938 15.4236 4.8562 111.6892 484.2499 33.0803 95.0338 34.4739 17.4369 13.5496 108.6232 20.4449 21.3829 4.8230 6.3116 7.7919 22.1196 38.3246 93.1038 93.1917 50.0908 35.2629 25.6280 52.8655 11.4288
temp: 298.150 k
press: 1.00000 atm
elementType: 8 7 7 6 6 6 6 6 6 6 6 6 6 1 1 1 1 1 1 1 1 1 1 1 1 1 1 1 1 1 1 1 1
symmnumber: 1
zpe: 768279.5 jmol-1
zpe.correction: 0.292622 hartree
zpe.thermalcorrener: 0.307631 hartree
zpe.thermalcorrenthalpy: 0.308575 hartree
zpe.thermalcorrgfe: 0.250191 hartree
zpe.sumelectzpe: -576.757705 hartree
zpe.sumelectthermal: -576.742696 hartree
zpe.sumelectthermalent: -576.741752 hartree
zpe.sumelectthermalfe: -576.800136 hartree
dipole: 5.2597 1.2043 -0.3547
dipole: 5.4074
quadrupole: -113.6480 -73.9118 -81.7304
quadrupole: -7.7215 0.9244 -0.2438
quadrupole: -23.8846 15.8516 8.0330 -7.7215 0.9244 -0.2438
hfenergy: -577.050327 hartree
pointgroup: C01 [X(C10H20N2O1)]
dipole: 2.0725784 0.4446564 -0.1809207 debye
polarizability: 159.9186158|0.807113|111.5568038|-2.6970911|-2.4600534|96.8377658 unknown
InChI: InChI=1S/C10H20N2O/c1-3-4-5-6-10(2)7-11-9(13)12-8-10/h11-12H,3-8H2,1-2H3
charge 0 multiplicity 1
33 atoms
O  -4.627004 -0.593396 0.004334
N  -2.393863 -1.278943 -0.049443
N  -2.941708 0.99546 -0.308058
C  -0.560348 0.402792 0.165897
C  0.878736 0.727794 -0.330726
C  -0.956459 -1.039907 -0.259547
C  -1.5422 1.36941 -0.560521
C  2.013386 -0.169857 0.21553
C  -0.687508 0.57807 1.699833
C  3.402879 0.258655 -0.310496
C  -3.393256 -0.310131 -0.123464
C  4.554344 -0.629167 0.213939
C  5.938933 -0.189817 -0.309411
H  1.10564 1.782438 -0.066745
H  0.89317 0.676212 -1.44079
H  -0.67623 -1.189839 -1.326223
H  -0.38848 -1.777983 0.336037
H  -1.377542 2.402523 -0.199311
H  -1.315486 1.360091 -1.649694
H  2.024249 -0.13836 1.32301
H  1.834906 -1.226635 -0.069651
H  -0.359304 1.590259 2.002645
H  -1.731805 0.444326 2.02963
H  -0.065601 -0.156955 2.241174
H  3.40003 0.236188 -1.420595
H  3.594568 1.313579 -0.022283
H  -2.738824 -2.229001 0.082513
H  -3.679729 1.696409 -0.359987
H  4.553325 -0.609234 1.323019
H  4.364621 -1.682414 -0.07782
H  5.976243 -0.230207 -1.414453
H  6.744191 -0.839698 0.079415
H  6.166425 0.849137 -0.004556
