program: Gaussian 09
title: 000257057
version: EM64L-G09RevD.01
frameworkgroup: C1[X(C11H22N2O4)]
method: RPBEPBE
basis: SDD
operation: Freq
keyword: #p
keyword: freq=noraman
keyword: PBEPBE/SDD
title: #p freq=noraman PBEPBE/SDD
converged: YES YES NO NO
title: Mulliken charges:
elementType: O O O O N N C C C C C C C C C C C H H H H H H H H H H H H H H H H H H H H H H
charge: -0.303866 -0.303955 -0.310209 -0.309800 -0.383196 -0.383238 0.299048 -0.401139 -0.400538 -0.727992 -0.728229 0.325361 0.325018 -0.221620 -0.221689 -0.680036 -0.680100 0.213106 0.251768 0.251528 0.212997 0.208403 0.217034 0.220588 0.220680 0.217215 0.208513 0.314427 0.314244 0.245697 0.219877 0.246242 0.219634 0.223770 0.230986 0.207372 0.223701 0.231042 0.207357
chargesum: 0.00000
title: Mulliken charges with hydrogens summed into heavy atoms:
elementType: O O O O N N C C C C C C C C C C C
charge: -0.303866 -0.303955 -0.310209 -0.309800 -0.068769 -0.068994 0.299048 0.063735 0.063987 -0.081966 -0.081822 0.325361 0.325018 0.243953 0.244186 -0.017908 -0.018000
polarizability: 1.85459500e+02 -1.62672742e-01 1.44234876e+02 -7.12220295e-02 -1.20072974e+01 1.16696636e+02
1716.lowfreq: -0.0009 -0.0007 -0.0006 5.7278 12.1824 14.4019 31.4602 32.6335 41.7486
frequency: 31.4340 32.2959 40.9928 50.8401 57.0920 69.4075 85.5961 116.4740 126.1041 127.5410 141.0958 162.4088 162.8536 199.9536 205.8860 244.2891 252.0511 252.2267 265.8672 295.0986 301.8090 325.2566 340.6220 355.3582 367.1280 430.7991 450.6825 542.3046 545.9077 576.5055 577.0864 663.5369 665.4178 698.7034 702.4706 761.8767 805.2757 806.8724 817.8758 841.3377 887.1147 892.7138 906.6272 934.2465 950.1580 969.2782 980.1996 1033.2966 1035.7553 1048.8606 1109.1817 1110.4062 1125.8008 1134.8838 1143.0989 1143.5042 1181.3851 1192.8317 1201.3611 1202.1352 1228.7619 1248.9108 1250.0632 1287.1049 1289.6196 1351.6629 1354.2025 1363.7738 1364.0943 1375.6458 1397.5057 1397.7266 1398.4419 1459.6453 1462.1968 1462.8327 1462.9031 1468.6740 1470.6415 1478.4358 1478.8409 1480.9422 1487.1707 1488.9215 1493.0563 1500.0441 1504.3499 1651.6981 1660.5227 2963.1942 2965.9852 2966.4190 2971.9438 2993.1071 2993.2534 3006.3892 3006.5087 3057.5324 3061.0600 3064.4536 3066.5272 3066.7310 3069.2259 3070.0678 3071.5031 3089.4289 3089.6356 3104.6532 3104.7556 3575.4905 3575.8198
redmass: 4.3484 2.9036 2.7665 2.4875 2.2713 4.6870 4.0842 3.6151 10.2598 3.5226 2.7601 1.7317 1.5354 1.3433 3.7269 2.3451 1.2257 1.2203 3.7174 3.6390 2.6555 4.6037 2.0508 3.3346 3.0537 2.7363 2.1811 2.4957 1.9163 1.4633 1.3974 6.0833 5.5165 11.1967 10.3071 3.8671 1.0943 1.0915 2.8867 3.1368 2.4375 1.9472 2.1634 1.4109 3.1913 3.0769 1.3750 2.6757 2.4420 1.8884 2.6021 2.4626 3.9412 4.5796 1.4631 1.4865 2.1787 1.7848 2.2755 2.6062 2.5618 1.1327 1.1341 1.5357 1.3173 1.2998 1.3287 1.3467 1.3355 1.2165 1.2658 1.2612 1.2342 1.0742 1.0789 1.0413 1.0409 1.1015 1.0748 1.0566 1.0532 1.0630 1.2730 1.1319 1.0821 1.4125 1.6177 8.4310 9.3533 1.0668 1.0545 1.0399 1.0461 1.0356 1.0356 1.0577 1.0578 1.0990 1.0982 1.0990 1.1070 1.1070 1.0945 1.0946 1.0980 1.0984 1.0983 1.1028 1.1028 1.0765 1.0766
irintensity: 0.0037 2.3975 0.3228 2.5149 0.5150 7.7609 17.5174 0.0227 0.4270 7.2350 0.0308 4.0686 3.2119 2.0010 2.9965 0.3722 1.1541 1.4329 5.6230 5.5519 1.5296 6.6502 3.1306 13.1227 2.2955 0.8011 1.6795 66.4354 6.5524 49.1438 154.7560 3.0655 7.4036 67.8552 0.3259 0.5719 7.1036 0.1107 10.7917 8.6237 0.1893 16.0430 24.2405 1.6217 54.9695 15.3637 0.3486 19.1471 107.2232 71.5282 40.5691 26.4763 38.9942 137.9445 6.9987 1.5562 61.5721 5.9378 338.4550 119.7987 0.1080 2.5125 1.8022 17.2946 86.7530 11.9526 6.2366 1.0639 7.4931 19.3764 24.6102 18.7462 30.0562 5.0700 44.2704 5.1263 15.7216 26.8937 20.5966 1.7192 19.7636 1.1380 63.6777 34.7258 26.5255 39.7609 386.2190 311.1532 269.0205 48.9706 24.1147 42.0950 71.3294 38.6796 12.4763 7.0099 36.1650 18.6701 44.7066 8.0035 8.0591 0.9449 20.2619 12.7339 59.0627 14.7064 51.0522 10.3591 81.5731 27.2998 24.1920
temp: 298.150 k
press: 1.00000 atm
elementType: 8 8 8 8 7 7 6 6 6 6 6 6 6 6 6 6 6 1 1 1 1 1 1 1 1 1 1 1 1 1 1 1 1 1 1 1 1 1 1
symmnumber: 1
zpe: 866881.4 jmol-1
zpe.correction: 0.330178 hartree
zpe.thermalcorrener: 0.351129 hartree
zpe.thermalcorrenthalpy: 0.352073 hartree
zpe.thermalcorrgfe: 0.279144 hartree
zpe.sumelectzpe: -841.424692 hartree
zpe.sumelectthermal: -841.403741 hartree
zpe.sumelectthermalent: -841.402797 hartree
zpe.sumelectthermalfe: -841.475726 hartree
dipole: 2.5394 -0.0150 -0.0057
dipole: 2.5394
quadrupole: -84.3130 -98.4874 -109.4728
quadrupole: -0.0362 -0.0159 -1.5752
quadrupole: 13.1114 -1.0630 -12.0484 -0.0362 -0.0159 -1.5752
hfenergy: -841.7548696 hartree
pointgroup: C01 [X(C11H22N2O4)]
dipole: -0.0163929 0.9989509 0.0017076 debye
polarizability: 143.8030151|-0.5945423|185.4516634|12.4926464|0.1691185|117.1363327 unknown
InChI: InChI=1S/C11H22N2O4/c1-5-16-9(14)12-7-11(3,4)8-13-10(15)17-6-2/h12-13H,5-8H2,1-4H3
charge 0 multiplicity 1
39 atoms
O  -2.517244 -1.084207 0.085637
O  2.54241 -1.003135 -0.087813
O  -0.585264 -0.93872 1.434121
O  0.60755 -0.914124 -1.437146
N  -1.66742 0.964006 0.567538
N  1.635183 1.019468 -0.572264
C  -0.046327 2.841167 0.000385
C  -0.718361 1.948555 1.090637
C  0.656529 1.975948 -1.092698
C  0.980202 3.756402 0.718663
C  -1.104921 3.721451 -0.715344
C  -1.49806 -0.392037 0.758899
C  1.504302 -0.34109 -0.762389
C  -2.313879 -2.556905 -0.012528
C  2.380746 -2.480872 0.01267
C  -3.529399 -3.117687 -0.744588
C  3.607037 -3.00456 0.754188
H  -1.218986 2.616464 1.822268
H  0.052683 1.374137 1.633065
H  -0.094709 1.379703 -1.639413
H  1.137442 2.663028 -1.81975
H  1.745904 3.168765 1.260836
H  1.496776 4.413927 -0.0053
H  0.478515 4.404026 1.461965
H  -0.625719 4.39578 -1.449521
H  -1.651896 4.350325 0.011674
H  -1.842807 3.108266 -1.267636
H  -2.467124 1.25749 0.006422
H  2.427062 1.335448 -0.012261
H  -1.37232 -2.728945 -0.56511
H  -2.209989 -2.969645 1.007378
H  1.440854 -2.678377 0.559504
H  2.295648 -2.898809 -1.006868
H  -4.458868 -2.905265 -0.188269
H  -3.616689 -2.678545 -1.753161
H  -3.429581 -4.213638 -0.850272
H  4.533775 -2.766654 0.203639
H  3.674624 -2.560664 1.762192
H  3.53822 -4.102676 0.862051
