program: Gaussian 09
title: 000257049
version: EM64L-G09RevD.01
frameworkgroup: C1[X(C9H18N2O4)]
method: RPBEPBE
basis: SDD
operation: Freq
keyword: #p
keyword: freq=noraman
keyword: PBEPBE/SDD
title: #p freq=noraman PBEPBE/SDD
converged: NO YES NO NO
title: Mulliken charges:
elementType: O O O O N N C C C C C C C C C H H H H H H H H H H H H H H H H H H
charge: -0.192365 -0.192343 -0.192051 -0.192126 0.138913 0.139025 0.361548 -0.417653 -0.418721 -0.490850 -0.491053 -0.388373 -0.388242 -0.699030 -0.698996 0.223331 0.225972 0.225620 0.223310 0.258932 0.257578 0.259265 0.257774 0.221328 0.219235 0.221016 0.220458 0.216566 0.219918 0.217841 0.217463 0.220021 0.216690
chargesum: 0.00000
title: Mulliken charges with hydrogens summed into heavy atoms:
elementType: O O O O N N C C C C C C C C C
charge: -0.192365 -0.192343 -0.192051 -0.192126 0.138913 0.139025 0.361548 0.031650 0.030209 0.025660 0.025986 0.052189 0.053232 -0.044705 -0.044822
polarizability: 1.55543503e+02 4.14414939e+00 1.27554643e+02 1.67395142e-01 3.11505546e-02 9.77832495e+01
1716.lowfreq: -5.8918 0.0006 0.0008 0.0010 2.8723 15.5078 23.9211 33.5038 45.8745
frequency: 23.8685 33.3404 45.8061 53.5303 84.1482 85.4991 92.3741 102.2563 137.2382 173.5214 209.3678 217.3548 226.8701 231.6209 243.2547 286.7859 291.4325 310.3139 388.8728 445.3465 453.2218 462.1923 557.2836 582.5440 584.9019 685.6657 704.0958 726.8299 755.2570 799.5142 834.6493 849.4253 856.4449 859.2244 885.0709 926.2823 930.0902 954.0208 959.6211 1042.8368 1052.8621 1068.7499 1101.8969 1110.6001 1122.6120 1167.1622 1167.7148 1173.8099 1224.1064 1239.7410 1242.7543 1245.1905 1266.2237 1303.0097 1304.6835 1304.8220 1309.9384 1337.9005 1338.3361 1351.4252 1361.6749 1390.3227 1391.2183 1418.5211 1421.2944 1453.1504 1462.7019 1466.9874 1468.7895 1471.2689 1477.0561 1478.4696 1478.7131 1483.4174 1488.7843 2977.5795 2977.9880 2979.1485 2981.3928 2986.6641 2991.7801 3023.6116 3027.0846 3045.5702 3046.2529 3050.1500 3050.4925 3078.1261 3078.8702 3079.7224 3079.8896 3117.9742 3122.4644
redmass: 7.9086 10.3522 2.7719 2.5218 8.9478 4.3996 2.3585 1.9220 4.9092 3.6570 2.7452 3.5380 6.4220 1.2003 1.2855 3.1748 2.2315 3.8963 3.0620 3.1685 2.2591 2.5469 2.6524 6.9829 6.8516 8.9757 2.3288 1.0997 1.5477 3.8336 8.0498 2.2996 1.2475 1.7736 7.7227 2.1464 1.7583 1.5605 1.7187 3.2190 2.9374 1.8492 1.4394 2.7024 1.9921 2.1354 4.4727 1.2056 5.3759 9.2149 1.3687 1.2546 1.2570 1.0906 1.5181 1.3630 1.1940 1.3063 1.3452 1.5499 1.4407 1.2074 1.2088 2.7543 5.0422 1.0835 1.0740 1.0746 1.0888 1.2271 1.0634 1.0416 1.0417 1.0671 1.0741 1.0400 1.0362 1.0547 1.0588 1.0589 1.0588 1.0995 1.0992 1.0570 1.1031 1.0561 1.1020 1.1019 1.1017 1.0996 1.0995 1.1083 1.1078
irintensity: 0.0239 2.1404 0.0202 0.1037 5.5247 1.5772 0.2166 0.8849 5.7401 0.0020 3.8794 1.4154 0.0323 0.0057 0.3256 0.9427 0.0109 0.4855 5.9591 1.1758 0.0181 1.2203 3.0308 2.7766 15.9199 3.2527 13.8960 0.0073 17.2234 0.7666 26.9530 0.0339 0.0204 3.9507 0.6796 6.1740 2.6074 0.0049 3.8916 0.3598 0.0793 36.0981 0.0125 1.0784 6.7188 23.5173 0.6792 0.0335 146.4095 11.8081 44.4308 0.0323 2.8822 0.4395 44.3458 2.8638 0.9986 5.9839 0.0581 7.3302 0.0292 8.3515 12.8367 235.6240 0.4553 16.8331 21.8111 1.7330 7.3798 15.3717 2.4666 0.2709 29.3493 11.2703 43.3274 40.6088 25.3944 3.7501 1.7202 0.4467 80.1282 0.0354 0.5551 0.0454 0.0297 21.7041 18.8213 1.5985 107.6754 53.7101 38.8103 0.0166 6.3013
temp: 298.150 k
press: 1.00000 atm
elementType: 8 8 8 8 7 7 6 6 6 6 6 6 6 6 6 1 1 1 1 1 1 1 1 1 1 1 1 1 1 1 1 1 1
symmnumber: 1
zpe: 717356.5 jmol-1
zpe.correction: 0.273227 hartree
zpe.thermalcorrener: 0.290737 hartree
zpe.thermalcorrenthalpy: 0.291681 hartree
zpe.thermalcorrgfe: 0.225897 hartree
zpe.sumelectzpe: -762.768053 hartree
zpe.sumelectthermal: -762.750543 hartree
zpe.sumelectthermalent: -762.749599 hartree
zpe.sumelectthermalfe: -762.815383 hartree
dipole: 0.0180 0.0055 -2.5151
dipole: 2.5152
quadrupole: -94.6688 -118.5240 -83.8487
quadrupole: 4.5921 -0.0623 -0.0262
quadrupole: 4.3451 -19.5102 15.1651 4.5921 -0.0623 -0.0262
hfenergy: -763.0412799 hartree
pointgroup: C01 [X(C9H18N2O4)]
dipole: 0.0119338 -0.0084689 0.9894492 debye
polarizability: 132.2490841|11.2559327|150.8423998|-0.4537965|0.0936696|97.7899115 unknown
InChI: InChI=1S/C9H18N2O4/c1-3-5-9(6-4-2,7-10(12)13)8-11(14)15/h3-8H2,1-2H3
charge 0 multiplicity 1
33 atoms
O  3.23648 -0.379855 0.064807
O  -3.247019 0.38879 0.15327
O  2.213686 -2.417457 0.125058
O  -2.22792 2.42792 0.221623
N  2.267754 -1.16024 0.398091
N  -2.271995 1.16621 0.474899
C  -0.008411 -0.000825 0.181949
C  -0.593331 -1.135524 -0.72011
C  0.547821 1.135778 -0.735856
C  1.096579 -0.549667 1.150175
C  -1.080807 0.546445 1.186863
C  -1.207842 -2.370135 -0.019922
C  1.181439 2.370335 -0.052649
C  -1.692769 -3.409218 -1.055433
C  1.648332 3.404482 -1.101275
H  0.214475 -1.479531 -1.395699
H  -1.363749 -0.683443 -1.374793
H  1.298321 0.685534 -1.41464
H  -0.280209 1.479791 -1.386592
H  1.520457 0.26036 1.764263
H  0.697658 -1.351874 1.790742
H  -1.488617 -0.2659 1.808783
H  -0.658711 1.34321 1.819143
H  -2.06822 -2.064698 0.605255
H  -0.459468 -2.851733 0.637866
H  2.053779 2.064106 0.555232
H  0.448096 2.855743 0.619027
H  -2.456799 -2.973462 -1.725749
H  -2.14087 -4.288612 -0.558888
H  -0.852646 -3.765232 -1.680182
H  0.797358 3.759682 -1.71175
H  2.107137 4.285103 -0.616838
H  2.398915 2.964717 -1.784075
