program: Gaussian 09
title: 000257034
version: EM64L-G09RevD.01
frameworkgroup: C1[X(C21H19NO)]
method: RPBEPBE
basis: SDD
operation: Freq
keyword: #p
keyword: freq=noraman
keyword: PBEPBE/SDD
title: #p freq=noraman PBEPBE/SDD
converged: YES YES NO NO
title: Mulliken charges:
elementType: O N C C C C C C C C C C C C C C C C C C C C C H H H H H H H H H H H H H H H H H H H
charge: -0.275665 -0.445634 -0.420359 -0.609235 0.524124 0.502443 0.207321 -0.365587 -0.459175 -0.426118 -0.393522 -0.239820 -0.224225 0.485282 -0.230655 -0.236592 -0.243166 -0.241855 -0.451533 -0.346986 -0.196817 -0.216659 -0.254394 0.218350 0.225523 0.251475 0.272668 0.228631 0.304774 0.230674 0.263130 0.226470 0.225380 0.222340 0.226011 0.229255 0.226937 0.219833 0.305360 0.226509 0.226527 0.228982
chargesum: 0.00000
title: Mulliken charges with hydrogens summed into heavy atoms:
elementType: O N C C C C C C C C C C C C C C C C C C C C C
charge: -0.275665 -0.140860 -0.202010 -0.132237 0.524124 0.502443 0.207321 -0.092919 -0.230544 -0.195444 -0.130392 -0.013350 0.001155 0.485282 -0.008315 -0.010581 -0.013911 -0.014918 -0.231700 -0.041626 0.029692 0.009868 -0.025413
polarizability: 2.70564768e+02 2.21031901e+01 2.17708791e+02 -1.38908691e+01 1.38288299e+01 2.08054058e+02
1716.lowfreq: -2.8737 -0.0006 -0.0004 0.0002 4.9353 8.3528 15.8534 25.7186 33.6341
frequency: 15.4596 25.5906 33.5628 39.3287 50.9153 53.3029 87.9901 109.1416 115.5597 156.6924 203.5929 207.1190 234.6473 264.0127 324.0384 335.8393 344.9026 379.2808 404.5556 405.0693 407.6496 478.7470 504.4990 518.7760 533.8755 587.8424 609.4293 614.4124 615.5220 618.4258 652.0375 679.6744 696.6923 706.2074 706.9947 722.9985 754.9845 770.0937 771.6022 803.9954 820.1905 843.3758 856.2560 856.7070 867.3070 887.1242 918.8602 923.0190 927.0863 973.7057 975.8636 978.6164 979.4509 985.0263 989.9409 990.6123 995.2553 998.4813 1001.0547 1022.8770 1027.5349 1028.0661 1035.1036 1077.0264 1087.0984 1088.9404 1154.4386 1171.2709 1172.1430 1172.4277 1180.5452 1188.1563 1189.0812 1190.7024 1201.5830 1216.9594 1238.2003 1258.7173 1310.0744 1316.6103 1326.3252 1335.0098 1344.8916 1381.0543 1382.7201 1386.8206 1427.5334 1441.6028 1442.0381 1466.9542 1480.1367 1483.7206 1485.2304 1511.4652 1591.0942 1591.5863 1599.6008 1608.7741 1613.3529 1613.9120 1619.3374 2983.5927 3006.9369 3070.3050 3110.0891 3110.6654 3111.1919 3123.7456 3126.2184 3132.3900 3135.1110 3137.7715 3145.0864 3146.0088 3148.8996 3161.9229 3163.6663 3165.5006 3197.1169 3525.9495
redmass: 5.9500 3.9509 3.9788 3.8333 4.7719 4.4504 5.0949 6.9183 4.4524 5.9417 5.0977 4.8036 4.7654 4.2946 7.1242 3.1520 4.3593 2.8767 2.8328 2.8434 2.9206 3.6538 3.5862 4.2380 3.4802 4.6330 5.5318 6.1264 6.3602 6.1670 1.1849 4.4001 1.9815 1.9698 1.8208 3.0496 1.9206 1.8555 2.1329 3.9101 4.6978 1.2709 1.2632 1.2491 3.5274 3.3805 1.4409 1.4972 1.4738 1.3534 2.1033 1.5387 1.4071 6.0091 5.2892 5.1527 1.3541 1.3482 1.3069 2.8653 2.2291 2.1784 2.9342 1.6019 1.5986 1.5558 1.7666 1.0891 1.0638 1.0515 1.4482 1.1161 1.1268 1.1281 2.2556 2.6013 1.4816 2.0918 1.4411 1.3587 1.3682 1.2427 1.4380 7.7379 6.8793 6.1226 2.3751 2.1741 2.1661 1.1264 2.2148 2.2881 2.3441 2.1294 6.1925 6.0285 6.6997 5.3983 5.3286 5.7372 5.1822 1.0836 1.0605 1.1029 1.0872 1.0885 1.0876 1.0861 1.0862 1.0867 1.0916 1.0915 1.0934 1.0959 1.0957 1.1015 1.1014 1.0999 1.0950 1.0762
irintensity: 0.7083 0.3354 0.0702 0.0606 0.0591 0.3258 1.9901 6.0955 0.3026 5.1723 0.4494 6.8563 0.1272 1.5339 3.8811 0.5030 0.3227 7.7478 0.3113 0.0319 0.0206 1.4402 27.2908 30.0477 21.2893 2.9893 1.2623 0.3915 0.0534 0.4754 34.4073 0.2778 49.8438 82.0007 8.8349 37.0418 31.3524 57.1611 72.7202 4.6267 0.6568 0.1739 0.9895 0.3085 2.1189 13.5163 13.1445 0.5513 10.4177 0.1882 3.2691 0.0709 0.1996 0.1148 0.1220 0.1130 0.9617 0.7071 2.7718 4.4542 14.7995 3.8600 3.9307 18.4318 1.0705 17.1992 53.3890 2.2768 0.0753 0.3688 14.6105 1.7795 0.7656 3.9128 1.2782 0.4476 15.7400 32.2746 23.0940 18.5588 14.4167 2.9764 9.7639 0.5061 20.8794 45.8997 102.5493 2.2552 13.5661 19.3850 50.0469 27.0333 50.6500 327.8170 10.9222 2.2605 67.9838 18.3014 42.4772 27.3993 31.4917 17.6402 29.7323 5.9562 12.7235 13.1404 8.7206 0.2368 0.1255 0.5513 18.2330 19.4374 28.9162 31.0013 22.9211 27.8140 28.3304 25.9269 6.9256 10.3988
temp: 298.150 k
press: 1.00000 atm
elementType: 8 7 6 6 6 6 6 6 6 6 6 6 6 6 6 6 6 6 6 6 6 6 6 1 1 1 1 1 1 1 1 1 1 1 1 1 1 1 1 1 1 1
symmnumber: 1
zpe: 894064.3 jmol-1
zpe.correction: 0.340531 hartree
zpe.thermalcorrener: 0.359982 hartree
zpe.thermalcorrenthalpy: 0.360927 hartree
zpe.thermalcorrgfe: 0.289117 hartree
zpe.sumelectzpe: -940.030430 hartree
zpe.sumelectthermal: -940.010979 hartree
zpe.sumelectthermalent: -940.010035 hartree
zpe.sumelectthermalfe: -940.081844 hartree
dipole: -0.1119 -0.4173 3.1329
dipole: 3.1626
quadrupole: -124.5508 -133.6191 -124.6410
quadrupole: 3.5171 -2.5847 2.1511
quadrupole: 3.0529 -6.0155 2.9626 3.5171 -2.5847 2.1511
hfenergy: -940.3709612 hartree
pointgroup: C01 [X(C21H19N1O1)]
dipole: 0.004236 0.1611304 1.2337622 debye
polarizability: 274.20731|14.9371611|212.601043|15.1320467|-14.8832204|209.519264 unknown
InChI: InChI=1S/C21H19NO/c23-21(22-19-14-8-3-9-15-19)20(18-12-6-2-7-13-18)16-17-10-4-1-5-11-17/h1-15,20,22H,16H2
charge 0 multiplicity 1
42 atoms
O  -0.170427 0.335861 -1.666729
N  -0.991742 0.787406 0.485831
C  1.221719 -0.280955 0.271053
C  1.649803 -1.604896 -0.447476
C  2.353378 0.75492 0.254211
C  0.665756 -2.745169 -0.227547
C  -0.043481 0.296493 -0.404574
C  2.752431 1.380499 -0.956062
C  3.044092 1.074003 1.450379
C  0.806417 -3.614955 0.885829
C  -0.42527 -2.948655 -1.112811
C  3.819079 2.305256 -0.963774
C  4.114118 1.997902 1.442501
C  -2.235432 1.428867 0.212939
C  -0.118671 -4.659203 1.113259
C  -1.351638 -3.991731 -0.888499
C  4.505438 2.61692 0.233601
C  -1.2032 -4.85024 0.225598
C  -3.021354 1.824611 1.329274
C  -2.704896 1.681622 -1.10386
C  -4.260837 2.46593 1.135454
C  -3.94914 2.325037 -1.280118
C  -4.734048 2.720995 -0.173127
H  0.994209 -0.531258 1.326877
H  2.650026 -1.880192 -0.064673
H  1.751094 -1.378716 -1.524124
H  2.211954 1.152132 -1.881598
H  2.748082 0.593568 2.39198
H  -0.765864 0.681554 1.477814
H  1.654699 -3.480728 1.569934
H  -0.545101 -2.281315 -1.974058
H  4.114506 2.784831 -1.903852
H  4.638937 2.233767 2.375244
H  0.009214 -5.325771 1.974077
H  -2.187029 -4.135908 -1.583113
H  5.333503 3.334474 0.224507
H  -1.919835 -5.661373 0.397546
H  -2.661308 1.630153 2.348255
H  -2.09775 1.373776 -1.956488
H  -4.855596 2.765612 2.005341
H  -4.306176 2.517579 -2.298125
H  -5.69736 3.219192 -0.325194
