program: Gaussian 09
title: 000257025
version: EM64L-G09RevD.01
frameworkgroup: C1[X(C9H9N3S)]
method: RPBEPBE
basis: SDD
operation: Freq
keyword: #pfreq=noraman
keyword: PBEPBE/SDD
title: #p freq=noraman PBEPBE/SDD
converged: NO YES NO YES
title: Mulliken charges:
elementType: S N N N C C C C C C C C C H H H H H H H H H
charge: 0.282809 -0.185118 -0.107134 0.013526 0.609951 -0.397190 -0.165101 -0.340195 -0.650660 -0.267086 -0.220022 -0.247534 -0.484461 0.248022 0.238107 0.287870 0.238149 0.245201 0.229204 0.231932 0.223937 0.215792
chargesum: 0.00000
title: Mulliken charges with hydrogens summed into heavy atoms:
elementType: S N N N C C C C C C C C C
charge: 0.282809 -0.185118 -0.107134 0.013526 0.609951 -0.397190 -0.165101 -0.092173 0.113465 -0.021885 0.009182 -0.015602 -0.044732
polarizability: 2.69834799e+02 -2.67835582e-01 1.33725552e+02 5.42637074e-03 1.31250738e-02 5.52306774e+01
1716.lowfreq: -1.9901 -0.0012 0.0012 0.0021 7.8373 10.1404 65.0227 109.8987 118.1007
frequency: 65.0142 109.8984 118.0991 131.5899 152.8570 176.4017 230.8253 257.0999 320.6734 322.3650 365.8969 425.3527 436.1711 468.8260 511.3652 536.9351 587.6033 618.2352 679.5798 681.5271 725.3335 750.7962 755.4133 815.1329 850.1859 929.6800 934.4714 973.3997 982.2183 1020.3908 1025.0219 1042.6067 1123.8711 1129.2901 1130.3333 1168.6610 1173.5897 1257.4450 1315.8628 1328.6626 1401.2458 1419.0663 1424.6347 1443.4338 1471.6402 1480.3624 1485.6759 1551.5402 1591.4406 1600.0549 1609.6620 2985.3652 3037.0637 3068.6127 3130.0178 3136.4606 3147.5503 3159.4035 3172.7791 3186.7614
redmass: 4.8665 4.5722 2.8455 3.4542 1.1676 4.1335 4.9573 3.2356 6.2216 4.9978 4.0875 6.3475 3.2112 10.1019 5.4342 4.4932 7.7608 5.6953 6.4063 6.2051 3.0391 1.3190 1.3544 4.8310 1.3662 1.3786 6.7704 1.3107 1.3630 3.6094 4.5705 2.5330 1.3008 1.5602 1.8547 1.6477 1.0776 1.6855 3.2305 3.1558 6.5566 1.3058 1.2801 2.2174 2.9809 1.1313 1.0434 4.3672 6.7112 7.1736 7.2579 1.0351 1.0605 1.1023 1.0990 1.0853 1.0898 1.0949 1.1006 1.1109
irintensity: 1.6076 0.8921 10.9613 1.5529 1.1265 0.7019 2.7104 0.5591 1.4263 0.0503 8.1991 0.0891 9.1876 16.5488 16.8696 0.8045 0.4300 1.4747 15.6063 1.5039 9.5091 44.1432 51.8845 55.3611 0.6049 2.6192 23.4686 0.0210 68.4065 24.8016 5.8724 1.6692 0.1295 3.6846 61.6660 43.6336 2.7359 15.4288 42.3473 14.8382 6.8600 21.9322 25.4222 5.4095 143.9795 11.4498 17.7687 587.9655 39.8282 97.9413 240.2120 46.3021 29.1140 24.3689 1.2508 1.0625 6.7423 18.8865 21.0711 12.9824
temp: 298.150 k
press: 1.00000 atm
elementType: 16 7 7 7 6 6 6 6 6 6 6 6 6 1 1 1 1 1 1 1 1 1
symmnumber: 1
zpe: 431441.9 jmol-1
zpe.correction: 0.164328 hartree
zpe.thermalcorrener: 0.176096 hartree
zpe.thermalcorrenthalpy: 0.177040 hartree
zpe.thermalcorrgfe: 0.126441 hartree
zpe.sumelectzpe: -909.704925 hartree
zpe.sumelectthermal: -909.693157 hartree
zpe.sumelectthermalent: -909.692212 hartree
zpe.sumelectthermalfe: -909.742812 hartree
dipole: -1.9365 2.3457 0.0003
dipole: 3.0417
quadrupole: -72.2916 -73.8564 -88.0755
quadrupole: 1.5137 -0.0003 0.0020
quadrupole: 5.7829 4.2181 -10.0010 1.5137 -0.0003 0.0020
hfenergy: -909.8692527 hartree
pointgroup: C01 [X(C9H9N3S1)]
dipole: -0.7700066 0.916065 0.000115 debye
dipolederiv: -0.1845863 -0.1329462 -0.000013 -0.5973826 -0.31068 -0.0000856 -0.0000555 -0.0000557 0.0832949 -1.6476489 -0.0689252 -0.0000543 0.3926603 -0.725147 -0.0001259 -0.0000574 0.0000623 -0.1490149 -2.1435706 0.0434985 -0.0000616 0.1272134 -0.5404663 -0.0000268 -0.0001237 -0.0000513 -0.2232419 0.7464709 -0.215382 0.0000417 -0.7810687 -0.016454 -0.0000376 -0.0000004 -0.0000077 -0.1379591 0.841377 0.3151581 0.0000348 0.6654887 -0.0332663 -0.0000101 0.0000872 -0.0000561 0.0872474 0.4239534 -0.1653238 -0.0000448 -0.4783645 -0.1395948 -0.0000059 -0.0000852 -0.0000072 -0.1144517 2.4914244 -0.0173787 0.0001175 0.4992734 0.8476555 0.0001659 0.000229 0.0001346 0.0598714 -0.0783279 -0.1221394 -0.000023 0.115664 0.0534747 0.0000797 0.0000375 0.0000725 -0.1959916 -0.0293149 0.0640951 0.0000945 -0.0609507 0.5181306 0.0001686 0.0001154 0.0001572 0.2457934 0.0578909 0.0354763 0.000011 0.1221169 0.1163937 0.000031 0.0000169 0.0000321 -0.1054306 -0.0232852 0.0064456 -0.0000138 -0.2114077 0.0656633 0.0000261 -0.0000602 0.0000395 -0.1599939 -0.1667686 0.0306413 -0.00001 0.1560328 -0.0487869 0.000028 0.0000274 0.0000182 -0.1846413 -0.3741567 0.1178099 -0.0000113 0.0390613 0.3161217 0.0000709 -0.0001196 0.0000922 -0.2728987 0.092266 -0.0233003 -0.0000024 0.0086027 -0.0856573 -0.0000584 0.0000106 -0.0000531 0.1717893 0.0677275 0.095718 -0.0961207 0.0323797 -0.0263096 0.033409 -0.0736142 0.0868953 -0.0547471 -0.0010051 -0.1169603 0.0001451 0.0025349 0.1560883 -0.0000471 0.0000801 -0.0000266 0.1303062 0.0680045 0.0954064 0.095899 0.0322854 -0.0263992 -0.0334412 0.0734478 -0.0871078 -0.0551073 0.1064735 0.0365542 0.000008 -0.0168421 -0.0653789 -0.0000326 -0.0000013 -0.0000328 0.1604744 -0.0923777 0.0818947 0.0000226 0.0968764 0.0415747 -0.0000249 0.0000273 -0.0000268 0.1629056 -0.0926224 -0.0877412 -0.0000066 -0.0883298 0.0356191 -0.0000184 -0.0000058 -0.0000172 0.1696383 -0.0503128 0.0601189 0.0000012 0.0824888 -0.0152052 -0.0000183 0.0000365 -0.0000299 0.1653107 -0.0116111 -0.0327199 -0.0000138 -0.1383327 -0.1173762 -0.0000465 0.0000075 -0.0000318 0.2168463 unknown
polarizability: 269.828858|0.938246|133.7314924|0.0053099|0.0131726|55.2306774 unknown
InChI: InChI=1S/C9H9N3S/c1-10-11-9-12(2)7-5-3-4-6-8(7)13-9/h3-6H,1H2,2H3
charge 0 multiplicity 1
22 atoms
S  0.660204 -1.634198 -0.000157
N  0.228127 1.020673 0.000186
N  2.551604 0.480226 0.000271
N  3.418191 -0.648554 0.000242
C  -1.062106 0.44875 0.000176
C  -1.043801 -0.973089 -0.000015
C  1.285205 0.115706 0.000085
C  -2.287671 1.14981 0.000366
C  0.456886 2.473628 0.00042
C  -2.238608 -1.710568 -0.000075
C  -3.490152 0.405844 0.000291
C  -3.470428 -1.009424 0.000065
C  4.694199 -0.35898 0.000372
H  -2.310435 2.243881 0.000599
H  0.010704 2.933781 -0.899892
H  1.542711 2.644423 -0.000459
H  0.012283 2.933328 0.901756
H  -2.221156 -2.805082 -0.000233
H  -4.448255 0.936371 0.000426
H  -4.410606 -1.57033 0.000008
H  5.396917 -1.199086 0.000263
H  5.079985 0.673488 0.000506
