program: Gaussian 09
title: 000257006
version: EM64L-G09RevD.01
frameworkgroup: C1[X(C12H17NO6S)]
method: RPBEPBE
basis: SDD
operation: Freq
keyword: #p
keyword: freq=noraman
keyword: PBEPBE/SDD
title: #p freq=noraman PBEPBE/SDD
converged: NO YES NO NO
title: Mulliken charges:
elementType: S O O O O O O N C C C C C C C C C C C C H H H H H H H H H H H H H H H H H
charge: 0.995927 -0.228559 -0.471667 -0.452192 -0.433288 -0.528997 -0.540340 -0.673734 -0.112354 -0.097241 -0.179113 -0.182701 -0.345919 -0.787922 0.524923 -0.339916 -0.352698 -0.215918 -0.215473 -0.223141 0.338614 0.275480 0.250316 0.259422 0.249995 0.214899 0.344529 0.328409 0.277617 0.364284 0.390141 0.367512 0.248793 0.245550 0.234603 0.234621 0.235538
chargesum: 0.00000
title: Mulliken charges with hydrogens summed into heavy atoms:
elementType: S O O O O O O N C C C C C C C C C C C C
charge: 0.995927 -0.228559 -0.107382 -0.062052 -0.065776 -0.528997 -0.540340 -0.329206 0.226260 0.178239 0.071203 0.076721 0.118975 -0.181897 0.524923 -0.091123 -0.107148 0.018685 0.019147 0.012398
polarizability: 2.84756366e+02 5.38203143e-01 1.36654045e+02 -3.35876247e+00 4.60656868e+00 1.65669605e+02
1716.lowfreq: -19.5725 -4.9361 -0.0013 -0.0008 0.0010 3.1612 19.3790 30.2144 33.4540
frequency: 15.6586 29.6279 33.0142 58.6310 70.8846 76.5063 109.7703 152.1669 157.4001 159.9501 179.3005 189.2098 212.7607 241.6091 277.8021 308.7914 327.6143 348.4583 352.2558 357.9753 378.2530 387.7656 400.5421 419.9327 442.7665 463.5561 494.7437 517.4093 527.1050 564.1457 576.0203 615.6495 616.6423 684.1747 694.1149 761.5826 773.3917 776.0109 796.0547 814.9761 823.8051 837.0436 850.5219 875.6325 886.5147 890.1589 933.8469 935.6132 955.5460 976.9036 982.1720 982.4937 989.4381 1003.2300 1013.9615 1026.6596 1031.4810 1063.7563 1069.3690 1084.0079 1110.1289 1132.5355 1177.1358 1189.1791 1192.0916 1213.2355 1225.3045 1233.4706 1235.7013 1239.2251 1271.0927 1296.9635 1317.3590 1319.2878 1331.6745 1331.7996 1351.6427 1367.4185 1381.8158 1390.0763 1395.6057 1430.1215 1441.9337 1444.2073 1450.2117 1485.1406 1588.4317 1610.8246 2997.5425 3001.8379 3021.4344 3032.7099 3034.5351 3079.2678 3088.8959 3109.3534 3130.8210 3135.8587 3137.8726 3145.8298 3157.9339 3171.2340 3318.7311 3405.1537 3573.5745
redmass: 6.7905 4.0610 5.5678 6.1660 5.6473 6.2895 6.7911 7.0620 8.2255 7.5521 6.0478 7.4166 5.8929 7.6423 4.9148 5.9767 6.1939 2.3538 2.5784 2.1271 3.4839 2.3106 2.7826 6.6042 7.1508 4.1381 2.7558 4.1034 1.4613 3.9367 4.3937 6.3064 4.7989 4.2738 1.6983 4.2279 2.0436 2.6212 2.8455 4.3638 5.5732 2.5488 1.2528 2.7819 2.0437 1.7647 1.4398 3.5082 2.8462 2.3125 2.3909 2.2388 6.0713 1.3413 3.3038 2.1900 2.0337 3.0017 2.9939 1.5597 2.4313 1.1229 1.0542 1.1115 1.1134 1.2192 1.1474 1.2680 1.2804 2.1642 1.3770 1.3387 1.2169 1.4298 1.2776 1.2785 1.2017 1.2792 1.5017 8.2988 1.3107 1.1591 1.1260 2.0440 1.1826 2.3427 5.9063 5.9682 1.0655 1.0844 1.0879 1.0664 1.0769 1.0849 1.0717 1.0993 1.0858 1.0918 1.1071 1.0926 1.0970 1.1018 1.0738 1.0645 1.0661
irintensity: 1.9473 0.0637 1.1457 2.6319 0.7994 5.6765 4.7549 3.9639 9.4971 6.3677 24.8877 1.0690 12.7310 2.8582 2.7952 12.7458 14.3659 65.1625 23.3053 2.8442 62.7864 76.3376 0.6270 11.2105 48.2162 24.0539 48.4848 18.8215 108.1826 35.6903 8.0503 0.0321 10.8441 20.8480 48.6874 30.6544 31.3696 131.7676 48.6340 0.6358 64.0480 47.8440 0.4322 25.2771 3.1031 98.1947 1.2428 19.9891 105.9278 89.3849 46.1805 47.4407 0.9104 0.0979 32.9505 1.8957 41.6279 48.6638 51.8829 21.9512 14.1390 5.7851 0.0437 34.8698 7.5931 6.4083 44.0541 11.6777 14.2488 43.4352 13.7114 20.6012 2.7208 21.8791 1.5218 3.9793 2.7818 3.6578 10.6481 3.1147 40.8326 74.8332 4.7853 17.0230 10.2869 2.6484 0.5602 12.1181 40.6388 6.6851 23.0989 32.3453 155.9266 81.4743 242.7417 11.9518 0.6791 1.3871 17.9249 13.2187 23.1562 21.4481 49.3550 45.7789 15.5209
temp: 298.150 k
press: 1.00000 atm
elementType: 16 8 8 8 8 8 8 7 6 6 6 6 6 6 6 6 6 6 6 6 1 1 1 1 1 1 1 1 1 1 1 1 1 1 1 1 1
symmnumber: 1
zpe: 749296.4 jmol-1
zpe.correction: 0.285392 hartree
zpe.thermalcorrener: 0.305350 hartree
zpe.thermalcorrenthalpy: 0.306294 hartree
zpe.thermalcorrgfe: 0.235192 hartree
zpe.sumelectzpe: -1369.904925 hartree
zpe.sumelectthermal: -1369.884967 hartree
zpe.sumelectthermalent: -1369.884023 hartree
zpe.sumelectthermalfe: -1369.955125 hartree
dipole: 0.6081 1.5619 1.1787
dipole: 2.0491
quadrupole: -92.8739 -135.9686 -130.4003
quadrupole: -9.4625 6.5103 -2.9543
quadrupole: 26.8737 -16.2210 -10.6527 -9.4625 6.5103 -2.9543
hfenergy: -1370.1903173 hartree
pointgroup: C01 [X(C12H17N1O6S1)]
dipole: -0.2527979 -0.0611598 0.7630643 debye
polarizability: 284.1505766|-9.1275125|148.0296451|4.4149257|14.467869|154.899795 unknown
InChI: InChI=1S/C12H17NO6S/c14-9-6-19-12(16)10(11(9)15)13-20(17,18)7-8-4-2-1-3-5-8/h1-5,9-16H,6-7H2
charge 0 multiplicity 1
37 atoms
S  0.534175 0.355652 -1.111072
O  -4.130024 0.602326 -1.062197
O  -1.397104 -0.707147 1.964347
O  -2.874179 -2.06895 0.129574
O  -3.755964 2.452449 0.4617
O  0.797212 1.865959 -0.555117
O  0.846145 -0.027169 -2.659975
N  -1.349657 -0.056009 -0.879431
C  -1.988458 0.860472 0.126758
C  -2.500431 0.027377 1.332827
C  -3.57405 -0.981087 0.844303
C  -3.173653 1.583709 -0.543521
C  -4.664114 -0.292649 -0.000843
C  1.359726 -0.977716 0.162127
C  2.807112 -0.697518 0.30715
C  3.263008 0.19861 1.313158
C  3.751303 -1.308895 -0.563782
C  4.640208 0.464481 1.454474
C  5.127569 -1.040061 -0.420259
C  5.574361 -0.154543 0.589764
H  -1.254442 1.617301 0.4673
H  -2.912776 0.717959 2.0857
H  -4.062635 -1.4719 1.705383
H  -2.8581 2.14561 -1.44388
H  -5.250909 -1.047586 -0.545802
H  -5.326839 0.294301 0.664815
H  -1.720963 0.108603 -1.839975
H  0.728134 -0.791283 1.046495
H  1.097943 -1.911268 -0.358022
H  -1.468899 -1.63895 1.607104
H  -2.215719 -1.603115 -0.491662
H  -4.432364 3.039399 0.038953
H  2.535731 0.684832 1.972779
H  3.402005 -1.984967 -1.352801
H  4.986597 1.154725 2.230884
H  5.850273 -1.513202 -1.093428
H  6.644175 0.054853 0.69967
