program: Gaussian 09
title: 000257005
version: EM64L-G09RevD.01
frameworkgroup: C1[X(C11H14N6O5)]
method: RPBEPBE
basis: SDD
operation: Freq
keyword: #p
keyword: freq=noraman
keyword: PBEPBE/SDD
title: #p freq=noraman PBEPBE/SDD
converged: YES YES NO NO
title: Mulliken charges:
elementType: O O O O O N N N N N N C C C C C C C C C C C H H H H H H H H H H H H H H
charge: -0.297867 -0.446716 -0.467844 -0.464250 -0.295976 -0.182848 -0.083820 -0.595268 -0.050040 -0.061617 -0.609645 -0.085369 -0.161451 -0.041696 -0.155597 -0.135072 0.201793 0.158058 -0.180425 -0.101971 0.166170 -0.363339 0.223981 0.229591 0.266099 0.240356 0.256735 0.373462 0.377586 0.265357 0.380646 0.343923 0.373092 0.245077 0.334106 0.344777
chargesum: 0.00000
title: Mulliken charges with hydrogens summed into heavy atoms:
elementType: O O O O O N N N N N N C C C C C C C C C C C
charge: -0.297867 -0.073255 -0.090258 -0.083604 -0.295976 -0.182848 -0.083820 0.121748 -0.050040 -0.061617 0.069238 0.138611 0.068140 0.224403 0.084760 0.121663 0.201793 0.158058 0.084932 -0.101971 0.166170 -0.118262
polarizability: 2.45098156e+02 -1.23864071e+01 1.43712660e+02 6.24641892e+00 1.39822798e+01 1.43104833e+02
1716.lowfreq: -10.2924 -2.5775 -0.0008 -0.0007 0.0001 7.7810 15.3864 36.1299 44.2194
frequency: 14.2782 36.0951 44.1947 68.6298 78.5286 104.9841 121.4488 156.1909 169.1386 191.8551 207.0040 225.0982 255.7141 259.7089 275.8138 284.0315 307.8098 346.0407 367.9123 373.7139 410.4784 431.1903 444.6257 485.8265 509.1356 516.2259 527.3512 530.0845 544.4283 547.3062 556.5874 584.0994 588.2621 624.4977 637.3946 650.7359 656.4986 666.6183 675.5932 705.7869 708.1453 791.3688 805.6379 822.6250 850.3072 891.1224 928.1937 930.4562 958.7940 968.3721 991.1973 1001.9049 1027.7690 1043.4272 1060.5409 1066.1965 1069.3934 1085.9016 1092.7231 1127.1791 1181.7604 1194.5730 1222.0984 1229.2603 1238.0191 1244.8359 1263.2109 1278.4011 1299.6951 1307.0012 1309.1724 1316.3619 1327.2794 1340.3025 1361.9897 1371.9296 1382.9443 1387.8033 1390.0065 1408.3735 1415.8175 1433.5673 1467.6252 1547.6118 1568.1614 1579.7471 1633.9274 1635.9636 2951.3534 2957.5136 2966.3399 2984.1379 3003.4270 3167.6227 3246.9346 3339.9808 3497.7559 3535.5935 3540.0581 3561.9714 3657.5451 3694.9949
redmass: 6.6240 6.3264 5.8383 6.7970 7.1936 8.2050 6.0587 6.7842 6.1081 6.7692 5.1280 4.7718 4.4788 5.1625 4.5891 4.7721 5.3331 7.2481 5.3165 3.4489 4.2957 1.1899 1.2518 3.4108 8.6282 1.2239 4.7292 4.3149 2.1609 1.3460 4.1864 3.8030 4.5019 1.6305 4.3166 4.9112 1.1548 1.0952 6.6104 6.0756 3.6634 3.9157 5.2244 2.0560 8.8975 5.4286 2.3539 2.4124 2.5904 5.2266 5.3264 4.9533 4.4113 3.2215 3.3739 2.5015 3.4765 2.3114 3.4561 2.8410 1.5716 2.0419 1.4867 1.2227 1.3263 1.2595 1.2542 2.7557 1.4626 1.8624 1.3780 2.7932 2.1501 1.3061 2.1387 1.5835 1.8374 3.0334 3.2740 1.5622 1.9364 2.9621 4.2553 8.2619 1.4893 1.8249 2.8485 3.7126 1.0809 1.0810 1.0836 1.0860 1.0855 1.0922 1.0985 1.0656 1.0453 1.0655 1.0443 1.0657 1.1044 1.1056
irintensity: 0.8175 0.6793 1.8151 5.4238 2.4341 1.9175 8.5710 1.3767 14.6421 0.7491 2.3321 2.2444 15.2989 7.1674 18.6079 0.7139 5.8097 3.9474 6.8285 8.2740 6.0118 98.6566 190.2329 6.0252 3.6100 268.4990 17.4501 24.1516 4.2722 0.8133 12.6032 41.4776 24.9027 51.4940 30.8157 46.8205 40.5686 268.1702 2.0823 41.7365 39.2936 13.1721 26.6674 6.9394 6.2931 67.7575 45.6948 123.9241 5.2874 26.4351 151.5460 94.8859 29.3078 15.3788 92.9970 9.0787 18.8804 33.4593 39.1361 13.5724 8.5980 27.0911 61.4038 23.0873 93.2355 6.1253 17.4003 144.6429 22.3624 39.2661 45.8561 29.4931 11.0650 43.1874 94.1174 5.2237 37.5411 14.2653 68.2937 40.1394 14.5097 111.2737 57.1002 67.1933 106.5174 30.3637 586.8697 320.0432 6.5731 6.1348 8.2268 80.1604 25.9856 15.8316 0.1539 164.1395 62.4321 30.1923 131.2098 33.0698 78.9285 50.2920
temp: 298.150 k
press: 1.00000 atm
elementType: 8 8 8 8 8 7 7 7 7 7 7 6 6 6 6 6 6 6 6 6 6 6 1 1 1 1 1 1 1 1 1 1 1 1 1 1
symmnumber: 1
zpe: 710850.0 jmol-1
zpe.correction: 0.270748 hartree
zpe.thermalcorrener: 0.290328 hartree
zpe.thermalcorrenthalpy: 0.291272 hartree
zpe.thermalcorrgfe: 0.221728 hartree
zpe.sumelectzpe: -1130.576257 hartree
zpe.sumelectthermal: -1130.556677 hartree
zpe.sumelectthermalent: -1130.555733 hartree
zpe.sumelectthermalfe: -1130.625277 hartree
dipole: -0.7804 1.0980 -2.3950
dipole: 2.7478
quadrupole: -129.2504 -122.8750 -127.5647
quadrupole: -5.1047 6.1697 -4.6682
quadrupole: -2.6870 3.6883 -1.0013 -5.1047 6.1697 -4.6682
hfenergy: -1130.8470054 hartree
pointgroup: C01 [X(C11H14N6O5)]
dipole: 0.2331821 0.748286 0.7445866 debye
polarizability: 241.6329211|23.6305016|138.2062009|3.530803|-10.6040322|152.0765266 unknown
InChI: InChI=1S/C11H14N6O5/c12-8-3-10(15-1-14-8)17(2-16-3)11-6(20)4(18)5(19)7(22-11)9(13)21/h1-2,4-7,11,18-20H,12-13H2
charge 0 multiplicity 1
36 atoms
O  -1.334059 0.672888 -0.001776
O  -0.4900 -2.927623 0.475807
O  -3.31402 -2.958648 0.751431
O  -4.733207 -0.837607 -0.659353
O  -4.65048 1.931182 -0.73168
N  0.785181 -0.305706 0.385113
N  2.538751 0.037626 1.82505
N  -2.599668 2.964754 -0.29546
N  1.920007 0.209404 -1.76625
N  4.284354 0.808869 -1.440226
N  5.313491 0.878593 0.686299
C  -1.2785 -1.710567 0.611555
C  -2.674161 -1.884345 -0.009579
C  -0.532951 -0.581872 -0.130948
C  -3.481739 -0.582581 0.044656
C  -2.65434 0.535937 -0.644208
C  -3.386198 1.881948 -0.559317
C  1.878756 0.072075 -0.412438
C  1.246207 -0.305416 1.716686
C  2.947987 0.275645 0.495419
C  4.19794 0.657968 -0.074477
C  3.165979 0.580789 -2.194338
H  -1.413854 -1.438567 1.681094
H  -2.571951 -2.184067 -1.07634
H  -0.420251 -0.831058 -1.205914
H  -3.668638 -0.294589 1.101719
H  -2.53531 0.270307 -1.718902
H  -1.07246 -3.68342 0.752151
H  -4.246071 -3.04786 0.424974
H  0.605589 -0.571038 2.553057
H  -5.18459 0.053891 -0.75977
H  -3.018941 3.891871 -0.230471
H  -1.603098 2.820601 -0.119787
H  3.286935 0.710346 -3.273795
H  6.181596 1.140705 0.223907
H  5.271415 0.760763 1.696314
