program: Gaussian 09
title: 000256985
version: EM64L-G09RevD.01
frameworkgroup: C1[X(C12H9ClO3)]
method: RPBEPBE
basis: SDD
operation: Freq
keyword: #p
keyword: freq=noraman
keyword: PBEPBE/SDD
title: #p freq=noraman PBEPBE/SDD
converged: YES YES NO NO
title: Mulliken charges:
elementType: Cl O O O C C C C C C C C C C C C H H H H H H H H H
charge: -0.046630 -0.239798 -0.204875 -0.203086 0.262388 0.404974 -0.667863 -0.355285 0.152815 0.042610 -0.357135 -0.326537 0.259142 -0.136713 -0.194801 -0.765639 0.256277 0.282274 0.277839 0.269532 0.271991 0.264229 0.254299 0.258576 0.241417
chargesum: 0.00000
title: Mulliken charges with hydrogens summed into heavy atoms:
elementType: Cl O O O C C C C C C C C C C C C
charge: -0.046630 -0.239798 -0.204875 -0.203086 0.262388 0.404974 -0.129312 -0.077446 0.152815 0.042610 -0.087602 -0.054546 0.259142 -0.136713 0.069428 -0.011347
polarizability: 2.57188311e+02 1.76783719e+01 1.46116350e+02 9.02759848e+00 -6.79415497e+00 7.30999761e+01
1716.lowfreq: -6.4404 -5.1923 0.0004 0.0013 0.0014 5.7873 22.1076 36.7946 57.0683
frequency: 21.6404 36.7828 57.0682 70.0319 121.3268 139.3595 161.7155 175.4544 266.8629 278.2732 293.2675 308.1881 348.3400 368.3941 396.7738 450.2530 456.4629 470.5502 504.0895 546.8131 563.7712 587.6822 631.1486 691.4088 721.7661 734.6255 747.2325 803.1551 823.2687 827.7162 867.2470 871.7269 906.6880 924.8880 953.1817 957.9973 987.9462 1027.5383 1070.0153 1122.3435 1150.9867 1173.5309 1184.2158 1207.6941 1247.9421 1263.6709 1299.2483 1371.0749 1371.9375 1398.3051 1414.7436 1440.8600 1442.6098 1453.6298 1467.1594 1558.7795 1603.4173 1622.8069 1644.6756 1655.5649 2966.3645 2981.9923 3061.2676 3066.4827 3125.1322 3162.4020 3165.3677 3167.6894 3186.1939
redmass: 3.6003 5.0661 5.9722 10.5249 1.7139 1.8728 9.7441 7.4396 3.9746 3.9502 5.0307 8.9238 5.9178 6.1973 3.6919 2.6474 3.1061 3.8597 8.8025 6.9972 3.7937 5.5788 6.9944 5.5422 6.2282 4.9400 5.2074 2.9086 1.4545 2.9977 1.4770 2.6340 4.4193 1.5524 1.3464 3.6678 2.4800 1.7869 2.1109 1.5579 2.1435 2.7205 1.2807 2.6084 2.2610 1.5510 1.7592 1.3770 1.8135 9.9736 3.4106 1.1376 1.0674 1.0594 3.0941 7.5651 7.8667 6.9311 7.8727 11.9808 1.0668 1.0380 1.0915 1.0954 1.1005 1.0932 1.0930 1.0889 1.0978
irintensity: 0.5085 5.8193 2.2047 4.9321 1.2570 0.4474 0.4034 3.9044 4.4483 1.9955 2.3699 2.6127 0.5619 3.9488 0.4669 1.7956 5.1217 23.4573 13.3783 18.7244 6.6711 5.2985 8.8995 5.2984 10.3969 7.7426 12.5645 2.4193 52.8622 30.6754 6.6704 9.5810 36.8167 22.1973 1.9167 40.1665 54.7537 12.3539 22.1987 14.2577 7.2549 127.4933 1.6136 19.6957 54.3296 9.6303 119.2044 21.4251 68.7584 0.6911 52.9107 22.6290 16.5087 15.3676 55.5053 52.6052 42.1795 8.2600 89.6478 403.9752 19.2801 3.3589 8.1676 7.6963 12.2702 0.4762 4.7156 0.0834 0.9789
temp: 298.150 k
press: 1.00000 atm
elementType: 17 8 8 8 6 6 6 6 6 6 6 6 6 6 6 6 1 1 1 1 1 1 1 1 1
symmnumber: 1
zpe: 467433.3 jmol-1
zpe.correction: 0.178036 hartree
zpe.thermalcorrener: 0.192511 hartree
zpe.thermalcorrenthalpy: 0.193455 hartree
zpe.thermalcorrgfe: 0.134350 hartree
zpe.sumelectzpe: -1147.282808 hartree
zpe.sumelectthermal: -1147.268333 hartree
zpe.sumelectthermalent: -1147.267389 hartree
zpe.sumelectthermalfe: -1147.326493 hartree
dipole: 1.1950 -1.4657 1.6459
dipole: 2.5070
quadrupole: -85.2144 -111.0656 -99.1011
quadrupole: -13.9597 5.4256 -4.6956
quadrupole: 13.2460 -12.6053 -0.6407 -13.9597 5.4256 -4.6956
hfenergy: -1147.4608436 hartree
pointgroup: C01 [X(C12H9Cl1O3)]
dipole: 0.4593235 -0.6477393 0.5850709 debye
dipolederiv: -0.6349023 -0.3109132 -0.083683 -0.4357533 -0.3692759 -0.058647 -0.0856553 -0.0414792 -0.0729918 -1.2678463 -0.404353 -0.1654883 0.0165206 -0.4192076 -0.0029866 -0.1973857 -0.0646541 -0.2215511 -1.0647687 -0.3802118 -0.1006604 -0.6657314 -0.9249658 -0.1093211 -0.0880259 -0.0309092 -0.3434744 -0.6409732 -0.0514469 -0.0822976 0.0575206 -0.5613566 -0.2387051 0.1074449 -0.2550679 -0.4884403 0.2426796 -0.251719 -0.0338914 -0.5269123 -0.4888839 -0.1371005 0.1718133 -0.0488744 -0.0900947 -0.2486342 -0.0198458 -0.0453555 0.1094767 -0.0966877 0.0292442 -0.0834405 0.0174649 0.003961 -0.3522526 0.1469613 0.1217825 0.4563216 -0.1661817 -0.1693394 0.3102264 -0.2849396 -0.1699033 0.4407432 0.1341995 0.0986584 -0.2268232 0.2459306 -0.0151867 0.0478737 0.0764452 -0.0214043 0.4806807 0.3414813 0.0546262 0.2687861 0.277585 0.0463727 0.0560416 0.0540008 0.1243114 1.5940402 0.5031745 0.2080659 0.7450284 1.2158136 0.1016539 0.1572898 0.0356593 0.3091795 -0.0444245 -0.1249557 0.0181139 -0.0321229 -0.0236977 -0.0172139 0.0089802 -0.0208091 -0.0910753 -0.0467116 -0.1101188 0.0226976 -0.080439 0.0525084 -0.0241643 0.0298554 -0.0386552 -0.148407 1.1200882 -0.0084688 -0.0805421 -0.363493 0.5900871 0.4429173 -0.5044492 0.4773601 0.5439431 0.7364502 0.5445357 0.118675 0.9016068 0.4815415 0.1235061 0.105801 0.0723888 -0.0583408 -0.2472275 -0.1070287 -0.0093795 -0.3086795 -0.0654318 -0.0545911 -0.0096306 -0.0238727 -0.0971562 -0.5825433 -0.0149622 0.0530576 -0.018338 -0.0233679 -0.0151408 0.1509537 -0.0154453 0.0177137 0.0139553 0.0295129 -0.0096108 0.0323586 0.0571172 0.0862275 -0.1006739 0.0711938 0.0072801 0.0302925 -0.0224875 0.013234 -0.1382868 0.0684058 -0.0275709 0.00649 0.0208265 0.1181548 0.106101 -0.000612 -0.0179445 0.0538573 -0.0094459 0.031082 -0.0057772 -0.0095559 0.1160202 0.098633 0.0385684 -0.0155113 0.0082029 -0.0089081 0.0127494 -0.0147962 0.0164505 0.1565813 0.088626 -0.0126411 -0.0163104 0.017929 -0.0154896 0.0149111 -0.0188628 0.01017 0.1714063 -0.0117969 0.0414507 -0.0370324 0.0245581 0.0927694 0.0097409 -0.036515 0.0130224 0.1575111 0.0998959 0.0028365 0.0011057 -0.0191964 -0.0147857 0.0837874 0.024912 0.07075 0.0836364 0.0144491 0.0380339 0.0180598 0.1006654 -0.0169708 -0.0812244 0.0529572 -0.0887189 0.0733964 0.0754461 -0.0009902 -0.0303693 0.0229437 0.122898 -0.031001 -0.085427 -0.0127504 -0.080256 unknown
polarizability: 253.2834457|20.3043522|148.0183335|23.5941764|6.305288|75.1028577 unknown
InChI: InChI=1S/C12H9ClO3/c1-7(14)4-9-5-8-6-10(13)2-3-11(8)16-12(9)15/h2-3,5-6H,4H2,1H3
charge 0 multiplicity 1
25 atoms
Cl -4.798328 -1.886725 -0.46927
O  -0.219661 1.94314 0.195668
O  1.995613 2.425659 0.571323
O  2.668992 -2.139633 -0.764751
C  1.35857 0.076257 0.631815
C  -1.028194 -0.376479 0.184844
C  2.782257 -0.34325 0.912644
C  0.317344 -0.819477 0.484936
C  -1.262169 1.022605 0.048551
C  1.135274 1.525446 0.478848
C  -2.125273 -1.268907 0.021926
C  -2.54385 1.536527 -0.237419
C  3.382801 -1.346215 -0.101357
C  -3.392956 -0.747467 -0.26189
C  -3.6214 0.644134 -0.394289
C  4.897698 -1.319352 -0.221969
H  2.852769 -0.844987 1.901743
H  3.426298 0.551071 0.975904
H  0.511263 -1.891601 0.582235
H  -1.969543 -2.348023 0.115125
H  -2.681211 2.616781 -0.333833
H  -4.624343 1.018211 -0.616912
H  5.200466 -0.417753 -0.78965
H  5.259995 -2.212789 -0.753113
H  5.37559 -1.246069 0.772192
