program: Gaussian 09
title: 000256977
version: EM64L-G09RevD.01
frameworkgroup: C1[X(C9H15NO2S)]
method: RPBEPBE
basis: SDD
operation: Freq
keyword: #p
keyword: freq=noraman
keyword: PBEPBE/SDD
title: #p freq=noraman PBEPBE/SDD
converged: YES YES NO NO
title: Mulliken charges:
elementType: S O O N C C C C C C C C C H H H H H H H H H H H H H H H
charge: 0.206738 -0.214841 -0.214389 -0.355212 -0.533977 -0.395591 -0.332272 -0.508071 0.244189 -0.352788 0.213872 -0.636740 -0.695490 0.294480 0.229363 0.247811 0.209091 0.182245 0.295811 0.199513 0.197925 0.355357 0.249175 0.247785 0.225114 0.209722 0.212067 0.219115
chargesum: 0.00000
title: Mulliken charges with hydrogens summed into heavy atoms:
elementType: S O O N C C C C C C C C C
charge: 0.206738 -0.214841 -0.214389 0.000145 -0.239497 0.081582 0.059064 -0.212260 0.244189 0.044650 0.213872 0.085334 -0.054586
polarizability: 1.63198391e+02 -1.21574868e+01 1.23313556e+02 -4.65461228e-01 3.02433840e+00 9.06793680e+01
1716.lowfreq: -8.5875 -0.0017 -0.0017 -0.0010 7.5643 9.9853 22.5839 46.4893 67.6658
frequency: 22.2673 46.4464 67.5298 74.9859 114.8096 124.8152 140.9246 205.3374 219.5738 226.3890 231.7190 243.2640 288.9678 309.2031 366.4408 399.4234 433.6432 439.4735 504.6687 542.3678 662.9903 678.0740 701.4111 712.8714 734.1810 797.7224 807.5099 824.1109 875.3535 912.3006 931.7552 991.5922 1014.8441 1053.5013 1056.3092 1061.8049 1075.9278 1111.1862 1115.9649 1184.9100 1212.3903 1234.4661 1243.0446 1254.5086 1270.6119 1286.8683 1292.2938 1294.4632 1308.7040 1340.0784 1358.8638 1383.9207 1390.7904 1392.0592 1460.4100 1465.4247 1468.4669 1474.2444 1477.1414 1477.6544 1488.2452 1612.6801 1628.8631 2959.8130 2970.7547 2973.9380 2987.1147 2992.0446 2996.1453 3003.5945 3028.0757 3058.4947 3066.5685 3070.8264 3074.2423 3088.6167 3106.9561 3468.7190
redmass: 7.0096 2.5305 2.0699 3.6154 3.3102 3.4432 4.0005 1.4971 1.4403 2.9240 1.7084 3.0332 4.0814 4.6190 8.2603 4.0593 5.8500 4.0360 5.0209 7.2815 5.1297 2.9987 2.2528 4.1004 1.2103 1.4770 2.5228 1.5168 2.6716 1.8208 1.4125 1.8850 3.8745 2.2478 1.7866 1.4579 2.4606 2.0417 2.4256 1.4835 1.4056 1.3779 1.2753 1.9663 1.4043 1.3424 1.1002 1.4347 3.9201 1.4772 1.6199 1.5646 1.2154 1.2931 1.0722 1.0465 1.0704 1.0519 1.0568 1.0497 1.0875 11.3809 4.7021 1.0606 1.0600 1.0364 1.0740 1.0358 1.0677 1.0973 1.1023 1.1022 1.0870 1.1009 1.0993 1.0980 1.1002 1.0750
irintensity: 0.2031 0.2240 0.0296 0.6262 1.4173 5.4000 2.6516 0.5823 0.5456 4.4317 1.0519 1.1541 2.3774 0.1382 21.6496 0.4904 1.3672 3.2483 28.6492 0.0588 1.5521 3.0134 3.5052 8.5645 13.4278 6.7922 0.8230 99.7862 1.2205 3.4612 12.0256 22.1166 3.6101 1.3307 7.1063 18.9168 1.3955 2.0495 8.0616 1.2681 13.6096 61.2386 3.1487 140.2423 13.1511 40.2194 1.9620 58.8236 81.4956 2.8076 3.3023 4.1209 13.1558 14.2072 3.6012 15.6979 0.6140 10.5435 7.4181 10.2468 18.5859 115.8260 375.3473 5.5225 48.5523 35.2114 9.9840 11.3354 27.3540 1.3047 16.4286 12.8864 0.9094 90.1272 52.1159 18.1604 14.3691 41.0545
temp: 298.150 k
press: 1.00000 atm
elementType: 16 8 8 7 6 6 6 6 6 6 6 6 6 1 1 1 1 1 1 1 1 1 1 1 1 1 1 1
symmnumber: 1
zpe: 603926.8 jmol-1
zpe.correction: 0.230024 hartree
zpe.thermalcorrener: 0.244716 hartree
zpe.thermalcorrenthalpy: 0.245660 hartree
zpe.thermalcorrgfe: 0.186908 hartree
zpe.sumelectzpe: -954.220564 hartree
zpe.sumelectthermal: -954.205872 hartree
zpe.sumelectthermalent: -954.204928 hartree
zpe.sumelectthermalfe: -954.263680 hartree
dipole: -1.8324 -2.0480 1.4680
dipole: 3.1157
quadrupole: -95.5213 -91.3629 -85.4182
quadrupole: -1.5296 2.8906 -2.2933
quadrupole: -4.7538 -0.5954 5.3492 -1.5296 2.8906 -2.2933
hfenergy: -954.4505879 hartree
pointgroup: C01 [X(C9H15N1O2S1)]
dipole: -0.7324161 0.830779 -0.525301 debye
polarizability: 162.9620104|12.5408829|123.0977839|0.7012581|4.8407055|91.1315204 unknown
InChI: InChI=1S/C9H15NO2S/c1-3-4-5-7-9(12)10-8(11)6(2)13-7/h6-7,10H,3-5H2,1-2H3
charge 0 multiplicity 1
28 atoms
S  0.268631 1.14802 0.972483
O  0.423994 -2.575247 -0.458917
O  4.05441 0.119637 0.3523
N  2.124894 -1.076352 -0.066668
C  -0.260041 -0.230933 -0.229947
C  -1.676715 -0.715667 0.138503
C  -2.776672 0.333028 -0.135182
C  2.000447 1.429769 0.250801
C  0.754487 -1.37793 -0.249015
C  -4.186225 -0.190116 0.223177
C  2.80373 0.132937 0.202348
C  1.981561 2.131054 -1.126576
C  -5.296334 0.844809 -0.058143
H  -0.27924 0.218091 -1.243257
H  -1.691712 -1.01848 1.20379
H  -1.874863 -1.633003 -0.447143
H  -2.572766 1.259445 0.438067
H  -2.75477 0.618374 -1.208156
H  2.503337 2.078215 0.987353
H  -4.207203 -0.474659 1.294783
H  -4.389502 -1.118226 -0.348903
H  2.739639 -1.90084 -0.109582
H  1.457277 3.097479 -1.045219
H  3.016354 2.316486 -1.467951
H  1.471397 1.524291 -1.895183
H  -5.317536 1.123635 -1.128576
H  -5.13395 1.769919 0.526304
H  -6.293526 0.448665 0.20691
