program: Gaussian 09
title: 000256966
version: EM64L-G09RevD.01
frameworkgroup: C1[X(C11H19NO2S)]
method: RPBEPBE
basis: SDD
operation: Freq
keyword: #p
keyword: freq=noraman
keyword: PBEPBE/SDD
title: #p freq=noraman PBEPBE/SDD
converged: YES YES NO NO
title: Mulliken charges:
elementType: S O O N C C C C C C C C C C C H H H H H H H H H H H H H H H H H H H
charge: 0.190755 -0.215338 -0.216127 -0.365904 -0.037497 -0.544901 -0.365514 -0.470383 -0.728772 0.223540 -0.370544 -0.390160 0.229565 -0.698708 -0.676015 0.238427 0.304032 0.196379 0.218677 0.288220 0.227900 0.206644 0.221465 0.200406 0.200573 0.248026 0.230156 0.353202 0.214494 0.210631 0.216433 0.207108 0.227792 0.225441
chargesum: 0.00000
title: Mulliken charges with hydrogens summed into heavy atoms:
elementType: S O O N C C C C C C C C C C C
charge: 0.190755 -0.215338 -0.216127 -0.012702 0.200929 -0.240870 0.049542 -0.182163 -0.072763 0.223540 0.030436 0.088021 0.229565 -0.057150 -0.015674
polarizability: 1.91993112e+02 -4.45260990e+00 1.37852949e+02 -1.10746060e+01 -1.49331396e-01 1.14649732e+02
1716.lowfreq: -17.8468 -9.4672 -4.5270 -0.0017 0.0004 0.0012 22.7029 38.8730 48.4311
frequency: 21.6670 38.4023 48.0128 59.6168 81.7065 93.3941 117.6840 136.4595 150.5266 178.9195 210.1831 212.3841 231.3346 235.4372 264.5532 294.8545 317.8206 329.6867 367.8613 394.6440 407.8077 439.7858 513.0464 524.6628 545.1663 648.4003 663.9826 705.1577 734.7278 752.5374 800.8918 820.4151 835.4437 845.6233 862.5843 884.3809 919.2715 943.7285 978.6048 1002.4389 1033.0899 1044.6766 1072.7746 1089.0295 1099.5476 1118.3285 1133.3812 1167.1393 1182.8212 1202.2861 1212.7917 1229.9736 1242.7140 1268.3023 1277.3166 1281.4933 1293.4845 1298.6298 1323.5608 1333.9684 1345.4726 1356.5667 1385.4062 1387.3517 1395.5422 1396.3608 1455.2520 1466.4395 1471.4641 1475.5786 1476.2316 1476.5504 1481.5693 1482.8317 1485.6265 1612.8861 1626.2729 2963.3877 2967.2528 2973.1844 2973.9700 2976.2700 2979.1706 2981.7032 2987.5630 3003.4039 3013.2036 3040.0001 3053.0977 3067.2957 3071.1434 3074.1260 3079.7006 3087.6302 3088.8369 3470.7058
redmass: 4.0388 2.8336 2.3021 4.8499 2.1042 3.0138 3.1534 8.1462 2.2478 1.9548 1.3226 1.4745 1.4776 2.3012 4.3377 3.8518 4.3846 3.4293 5.2406 3.9699 5.0182 2.7201 4.3713 5.0304 4.4414 6.4138 4.7120 2.4573 1.1271 3.8046 1.3438 1.5795 1.8870 3.3455 1.4322 2.5886 1.9722 2.2461 1.6191 1.4251 2.2716 1.6707 2.2022 1.8249 1.9566 2.5272 2.1594 1.5002 1.9066 1.3063 1.7883 1.4327 1.4339 1.5975 1.2428 1.3404 1.7956 1.8490 1.5469 1.3483 1.5611 1.5113 1.7167 1.2110 1.2082 1.2087 1.0773 1.0653 1.0661 1.0506 1.0438 1.0457 1.0474 1.0596 1.0703 12.0704 4.7420 1.0637 1.0791 1.0404 1.0575 1.0815 1.0375 1.0365 1.0803 1.0619 1.0979 1.1023 1.0996 1.0991 1.1004 1.0998 1.1001 1.0999 1.0984 1.0751
irintensity: 0.1001 0.0811 0.1115 0.4120 0.7096 0.1262 0.4989 6.8613 0.6580 0.0930 0.3419 0.1609 0.3825 1.7117 3.1384 8.9388 8.1560 1.5095 6.4954 4.0581 7.9145 1.4182 1.9799 7.7544 0.6145 1.9784 3.1071 4.0243 8.5029 9.4680 69.1218 37.0650 5.3169 16.6866 16.7100 10.5935 7.4546 7.1332 6.1914 5.8907 0.1199 1.4072 2.9110 4.8781 16.6835 0.7656 5.6772 2.1772 2.8771 1.8579 111.4253 11.8899 22.3286 75.4301 47.5939 28.0015 42.3379 65.7895 17.1102 0.6575 9.6744 6.2632 0.1559 8.3187 2.7495 35.7356 1.9362 8.2409 2.0620 12.6328 2.9929 21.2240 9.3012 13.1074 17.8911 96.4407 392.2196 4.5889 24.1731 47.1790 26.0134 5.6711 23.9737 30.0838 20.2721 12.9045 0.6390 22.6027 0.6893 24.3845 77.5232 56.8208 44.0956 51.5639 27.6998 39.5938
temp: 298.150 k
press: 1.00000 atm
elementType: 16 8 8 7 6 6 6 6 6 6 6 6 6 6 6 1 1 1 1 1 1 1 1 1 1 1 1 1 1 1 1 1 1 1
symmnumber: 1
zpe: 748552.2 jmol-1
zpe.correction: 0.285108 hartree
zpe.thermalcorrener: 0.302715 hartree
zpe.thermalcorrenthalpy: 0.303659 hartree
zpe.thermalcorrgfe: 0.238110 hartree
zpe.sumelectzpe: -1032.667421 hartree
zpe.sumelectthermal: -1032.649815 hartree
zpe.sumelectthermalent: -1032.648871 hartree
zpe.sumelectthermalfe: -1032.714420 hartree
dipole: -0.1313 -2.4225 1.5449
dipole: 2.8762
quadrupole: -103.2220 -105.9119 -98.1673
quadrupole: -2.7338 3.8460 -0.3486
quadrupole: -0.7883 -3.4782 4.2664 -2.7338 3.8460 -0.3486
hfenergy: -1032.9525297 hartree
pointgroup: C01 [X(C11H19N1O2S1)]
dipole: 0.0949408 -0.9569525 -0.5964478 debye
polarizability: 191.7577244|6.4626132|138.280791|-10.4226135|-0.4892026|114.457278 unknown
InChI: InChI=1S/C11H19NO2S/c1-4-6-7(3)9-11(14)12-10(13)8(5-2)15-9/h7-9,12H,4-6H2,1-3H3
charge 0 multiplicity 1
34 atoms
S  -0.562209 -1.15488 0.367966
O  0.933759 2.372915 -0.683209
O  -3.395028 1.591229 0.635914
N  -1.212461 1.803583 -0.071181
C  1.87095 -0.346119 -0.917612
C  0.358751 -0.013712 -0.853817
C  2.544912 -0.286702 0.480913
C  -2.286094 -0.482842 -0.081199
C  2.096231 -1.697004 -1.635739
C  0.081628 1.458159 -0.527008
C  4.09015 -0.328019 0.43288
C  -3.379292 -1.271454 0.664187
C  -2.358821 1.021094 0.203254
C  4.721675 -0.149551 1.830677
C  -3.508087 -2.730171 0.181322
H  2.319353 0.461724 -1.531943
H  -0.097937 -0.22284 -1.844103
H  2.174893 -1.125222 1.106987
H  2.239178 0.648946 0.988395
H  -2.396918 -0.630425 -1.17581
H  3.172623 -1.887092 -1.786303
H  1.614809 -1.705774 -2.632081
H  1.677989 -2.536605 -1.050487
H  4.452229 0.474445 -0.24165
H  4.433966 -1.286948 -0.00189
H  -4.332942 -0.73172 0.519188
H  -3.171232 -1.238628 1.750594
H  -1.335688 2.807696 0.11778
H  4.429765 0.820645 2.274354
H  4.389652 -0.947678 2.521325
H  5.825561 -0.181691 1.782215
H  -3.761569 -2.772623 -0.894897
H  -2.569343 -3.29333 0.328733
H  -4.308952 -3.250301 0.736248
