program: Gaussian 09
title: 000256960
version: EM64L-G09RevD.01
frameworkgroup: C1[X(C12H15NO3S)]
method: RPBEPBE
basis: SDD
operation: Freq
keyword: #p
keyword: freq=noraman
keyword: PBEPBE/SDD
title: #p freq=noraman PBEPBE/SDD
converged: YES YES NO NO
title: Mulliken charges:
elementType: S O O O N C C C C C C C C C C C C H H H H H H H H H H H H H H H
charge: 0.214571 -0.383895 -0.252000 -0.288895 -0.637897 -0.533449 -0.758845 -0.359070 0.534871 -0.690871 0.267452 -0.436001 -0.309734 0.298726 -0.218509 -0.237479 -0.236005 0.293134 0.334491 0.209633 0.251695 0.202600 0.247389 0.220381 0.233175 0.259285 0.230626 0.228196 0.231782 0.325368 0.372250 0.387024
chargesum: 0.00000
title: Mulliken charges with hydrogens summed into heavy atoms:
elementType: S O O O N C C C C C C C C C C C C
charge: 0.214571 0.003130 -0.252000 -0.288895 0.059722 -0.240315 -0.424354 0.102258 0.534871 -0.020502 0.267452 -0.202827 -0.050449 0.298726 0.012117 -0.009283 -0.004223
polarizability: 2.24469526e+02 5.79074858e+00 1.35115521e+02 6.20902429e+00 -9.34994716e+00 1.41016316e+02
1716.lowfreq: -13.6988 -7.8953 -4.0754 -0.0019 -0.0012 0.0011 26.9598 40.3513 46.3829
frequency: 26.7046 40.3141 46.3409 75.2165 78.9557 90.1514 92.5219 143.7122 154.2383 159.5439 186.2690 205.8809 221.4635 255.1157 280.8908 304.5891 348.4087 363.6351 402.8635 451.7154 492.9262 542.7676 557.9192 580.9240 589.2750 614.6523 626.5021 654.5993 671.9092 700.9582 727.6974 729.9640 750.9293 773.2691 776.4280 816.7652 843.0324 849.9419 885.3261 926.1797 929.9626 975.5466 990.9927 997.3101 1028.9651 1038.5861 1072.8807 1078.4716 1097.4498 1102.1218 1125.4486 1165.3825 1174.7568 1194.1810 1195.9094 1209.3006 1242.5086 1284.4706 1286.7672 1333.1203 1340.5335 1343.3455 1361.3320 1386.5034 1387.3668 1442.7390 1456.5932 1474.9524 1483.8452 1487.2919 1588.9779 1592.9803 1612.5569 1619.0273 1640.3259 2981.1087 3000.2320 3031.7944 3060.6379 3062.3332 3080.8384 3092.6646 3122.5350 3131.4075 3145.3457 3161.1047 3173.7425 3387.5281 3505.7251 3613.9104
redmass: 4.8684 4.8086 4.7599 5.5348 5.4003 5.1465 3.1047 6.7079 5.5397 6.7268 3.1136 2.1970 2.6662 4.2747 2.4245 5.2608 5.8056 8.0687 2.7982 2.9313 3.8471 2.7754 2.3617 3.5347 2.5285 5.7206 2.7618 1.7790 3.0279 1.7693 3.0459 1.3984 1.6647 3.0955 2.9185 4.2725 1.7505 1.2510 4.4444 1.5198 1.8094 1.3993 6.1443 1.3219 2.2019 1.9468 1.8502 1.7878 1.8547 1.9530 2.1439 1.1638 1.0552 1.1301 1.1776 1.9271 1.4116 1.4340 1.8508 1.4002 2.2424 1.3787 2.1972 5.9141 1.2292 2.1654 1.0810 1.0475 2.2940 1.0489 3.2479 5.7079 5.4313 1.9862 3.4460 1.0360 1.0615 1.0863 1.0988 1.0860 1.0992 1.1013 1.0868 1.0877 1.0930 1.0974 1.0986 1.0562 1.0639 1.0959
irintensity: 0.9003 0.8720 0.0798 2.2842 1.4576 3.1034 1.3717 3.0415 0.7618 0.7229 2.7023 0.4484 3.2439 0.3650 6.5328 5.3614 1.8025 1.5211 0.0271 5.5624 4.8013 33.8185 32.5943 9.7576 50.0764 10.4079 101.2291 167.4619 57.4226 58.3336 18.8448 139.5843 16.7474 21.3148 25.5768 5.5175 6.7537 0.0615 7.1048 3.6264 8.7245 0.0460 0.7871 0.1734 8.2977 2.1034 17.5091 46.9860 184.1248 17.5469 4.9573 2.7519 0.7326 1.6132 4.1143 6.0114 8.9818 31.4021 8.1478 10.8359 51.4594 13.3246 46.3285 1.4666 13.6793 8.8993 12.1959 12.0078 13.6615 11.8252 310.9412 6.3858 1.7583 19.0615 261.6215 40.0280 17.4531 9.3736 2.9263 1.3004 41.7924 31.2734 4.6876 1.2271 27.2345 31.9699 6.1100 168.1621 41.8551 69.4264
temp: 298.150 k
press: 1.00000 atm
elementType: 16 8 8 8 7 6 6 6 6 6 6 6 6 6 6 6 6 1 1 1 1 1 1 1 1 1 1 1 1 1 1 1
symmnumber: 1
zpe: 659943.3 jmol-1
zpe.correction: 0.251359 hartree
zpe.thermalcorrener: 0.269003 hartree
zpe.thermalcorrenthalpy: 0.269947 hartree
zpe.thermalcorrgfe: 0.204258 hartree
zpe.sumelectzpe: -1143.516830 hartree
zpe.sumelectthermal: -1143.499185 hartree
zpe.sumelectthermalent: -1143.498241 hartree
zpe.sumelectthermalfe: -1143.563931 hartree
dipole: -2.5015 3.6450 0.7028
dipole: 4.4763
quadrupole: -104.4552 -108.8975 -100.6222
quadrupole: 10.1082 -1.1877 -3.9892
quadrupole: 0.2031 -4.2392 4.0361 10.1082 -1.1877 -3.9892
hfenergy: -1143.7681887 hartree
pointgroup: C01 [X(C12H15N1O3S1)]
dipole: 0.9456041 -1.4099784 0.4683369 debye
polarizability: 225.010981|3.4947073|137.0192406|-2.845155|10.0148673|138.571142 unknown
InChI: InChI=1S/C12H15NO3S/c1-2-9(11(13)14)17-10(12(15)16)8-6-4-3-5-7-8/h3-7,9-10,15H,2,13H2,1H3
charge 0 multiplicity 1
32 atoms
S  -0.685647 0.142949 -1.093079
O  0.850069 -2.658379 0.335732
O  -3.245647 2.112459 0.455565
O  -0.969864 -2.007352 1.594584
N  -2.567395 0.438523 1.92611
C  -2.504809 -0.049136 -0.483532
C  0.35674 -0.261244 0.491482
C  -3.395012 0.205825 -1.71641
C  1.805017 0.082838 0.209224
C  -4.874248 -0.146748 -1.438386
C  -2.805061 0.94255 0.659289
C  2.419621 1.104395 0.977253
C  2.550903 -0.551404 -0.818527
C  0.016626 -1.690037 0.871732
C  3.7610 1.477236 0.737192
C  3.888636 -0.174532 -1.060717
C  4.499799 0.837555 -0.283611
H  -2.606313 -1.091416 -0.132532
H  -0.04695 0.387543 1.285086
H  -3.018947 -0.39484 -2.566858
H  -3.316144 1.273697 -1.988329
H  -4.990831 -1.206666 -1.143389
H  -5.284303 0.489235 -0.634675
H  -5.483077 0.021525 -2.344766
H  1.846062 1.612525 1.761963
H  2.085071 -1.338707 -1.41803
H  4.223207 2.266581 1.339928
H  4.455492 -0.668532 -1.8576
H  5.538836 1.127626 -0.475346
H  -2.771594 1.035649 2.727824
H  -2.188816 -0.508578 2.061138
H  0.520483 -3.558842 0.605888
