program: Gaussian 09
title: 000256955
version: EM64L-G09RevD.01
frameworkgroup: C1[X(C11H21NO3S)]
method: RPBEPBE
basis: SDD
operation: Freq
keyword: #p
keyword: freq=noraman
keyword: PBEPBE/SDD
title: #p freq=noraman PBEPBE/SDD
converged: YES YES NO NO
title: Mulliken charges:
elementType: S O O O N C C C C C C C C C C C H H H H H H H H H H H H H H H H H H H H H
charge: 0.202811 -0.392526 -0.294739 -0.252329 -0.637632 -0.006534 -0.632659 -0.367484 -0.727745 -0.371927 -0.520635 0.279529 -0.359414 -0.696395 0.261031 -0.691861 0.217681 0.352780 0.189753 0.211106 0.250211 0.207401 0.230263 0.203031 0.201397 0.294548 0.209466 0.250746 0.211014 0.218569 0.211462 0.203216 0.246196 0.220036 0.381987 0.325269 0.372377
chargesum: 0.00000
title: Mulliken charges with hydrogens summed into heavy atoms:
elementType: S O O O N C C C C C C C C C C C
charge: 0.202811 -0.010539 -0.294739 -0.252329 0.060013 0.211147 -0.279879 0.033375 -0.039871 0.032501 -0.226086 0.279529 0.100798 -0.055349 0.261031 -0.022413
polarizability: 1.91170984e+02 -4.80772532e+00 1.45303381e+02 6.53005522e+00 5.40457638e+00 1.34037469e+02
1716.lowfreq: -9.6179 -8.6246 -2.1851 -0.0008 0.0007 0.0013 27.3495 41.9089 52.7140
frequency: 27.2085 41.8929 52.7105 77.6569 80.3060 86.4782 92.7619 104.5774 137.2862 156.6537 159.3595 175.5923 187.8263 207.6439 209.3402 225.6609 233.2074 234.2720 279.4536 288.9211 323.6164 352.4816 409.8006 451.8649 460.3237 492.2925 555.2471 579.0862 583.3443 624.8481 654.6677 679.0422 735.3261 739.4349 753.0047 761.3249 778.4705 793.3411 843.8554 855.5874 868.0047 903.0795 929.2649 969.3902 1002.0457 1040.9950 1047.9030 1069.5806 1073.6229 1081.1085 1103.0535 1106.5398 1127.7757 1151.8954 1170.3883 1196.9056 1214.0367 1229.2683 1245.3706 1275.0607 1284.2904 1292.6619 1305.7752 1314.4118 1332.5769 1343.6337 1347.3515 1363.5331 1364.9163 1388.5105 1392.3599 1395.6498 1456.4690 1464.7679 1472.7582 1474.1082 1475.9873 1477.9637 1484.7066 1486.5201 1487.9120 1586.1028 1617.2684 1640.3192 2963.7276 2968.8862 2973.9780 2975.2850 2981.4541 2988.6732 2999.9957 3005.3053 3032.8597 3036.2125 3060.3826 3062.5362 3070.2959 3073.9913 3074.5711 3080.5577 3092.0316 3107.5701 3385.9538 3495.4630 3613.3138
redmass: 4.6199 3.8294 4.3080 1.7577 5.8594 2.7474 4.8032 4.5150 4.1389 2.5359 3.2318 5.0893 3.4287 1.6688 1.2395 4.1299 2.0380 1.2958 2.3126 3.8609 4.4057 4.6650 3.1210 2.9126 3.3435 4.0946 2.1701 2.3634 2.3955 2.3888 1.7927 2.4612 1.5287 1.5234 1.6174 2.3070 2.8858 4.5390 1.7699 2.1039 1.3205 2.1855 1.8767 1.7464 1.3135 1.9984 2.4051 1.7620 1.8046 2.5492 1.9727 1.9715 2.1700 1.9384 2.4258 1.1870 1.1770 1.3905 1.3968 1.2287 1.4335 1.1959 1.5280 1.3565 1.4053 1.5066 1.6763 2.0793 1.5177 1.2139 1.2145 1.2161 1.0808 1.0699 1.0482 1.0581 1.0473 1.0428 1.0621 1.0487 1.0725 3.7840 1.7569 3.2643 1.0590 1.0750 1.0405 1.0625 1.0358 1.0377 1.0614 1.0994 1.0865 1.1028 1.0989 1.0849 1.1004 1.0992 1.0991 1.0992 1.1013 1.0986 1.0563 1.0637 1.0958
irintensity: 0.7015 0.9379 0.1051 0.2431 2.2813 1.1090 3.5121 1.3726 2.0909 0.3844 0.7421 1.7187 0.0448 1.2363 0.3598 0.8447 1.4127 0.3834 3.9191 6.6716 0.6578 1.4668 3.8828 4.8999 1.2498 21.6881 44.2642 37.9737 11.7543 60.1327 180.0097 70.5085 7.5039 122.2224 20.7303 31.7323 27.9576 0.1247 8.8306 5.8576 6.5680 2.8270 12.3065 13.7374 5.2321 1.8435 13.2511 165.1508 5.6018 22.7856 10.5996 31.4525 9.4931 24.6021 3.7539 2.8008 3.1109 1.7129 8.2518 3.3693 26.3142 1.5362 2.3717 2.6067 10.3144 27.7258 24.4704 54.1609 13.3694 18.1262 11.4073 20.2686 11.6488 0.5903 7.1144 6.8878 11.8077 10.8979 6.4807 12.0343 16.6045 255.8355 19.9678 256.9939 10.3734 14.1271 24.1477 76.7922 36.5020 26.7216 17.6121 0.9397 6.8149 36.8949 2.6823 2.7144 63.7071 38.2018 58.8507 42.4865 32.6084 16.7581 156.2464 35.0321 64.2179
temp: 298.150 k
press: 1.00000 atm
elementType: 16 8 8 8 7 6 6 6 6 6 6 6 6 6 6 6 1 1 1 1 1 1 1 1 1 1 1 1 1 1 1 1 1 1 1 1 1
symmnumber: 1
zpe: 816957.7 jmol-1
zpe.correction: 0.311163 hartree
zpe.thermalcorrener: 0.331111 hartree
zpe.thermalcorrenthalpy: 0.332055 hartree
zpe.thermalcorrgfe: 0.262061 hartree
zpe.sumelectzpe: -1108.990068 hartree
zpe.sumelectthermal: -1108.970120 hartree
zpe.sumelectthermalent: -1108.969175 hartree
zpe.sumelectthermalfe: -1109.039169 hartree
dipole: 3.0926 -0.9681 2.9926
dipole: 4.4110
quadrupole: -105.7029 -105.5793 -106.8394
quadrupole: 6.2202 -5.9281 1.1107
quadrupole: 0.3376 0.4612 -0.7989 6.2202 -5.9281 1.1107
hfenergy: -1109.3012307 hartree
pointgroup: C01 [X(C11H21N1O3S1)]
dipole: -1.186444 -0.3287471 -1.2231059 debye
polarizability: 190.8845734|3.8671817|145.3677662|8.3014884|-5.163918|134.2594938 unknown
InChI: InChI=1S/C11H21NO3S/c1-4-6-7(3)9(11(14)15)16-8(5-2)10(12)13/h7-9,14H,4-6,12H2,1-3H3
charge 0 multiplicity 1
37 atoms
S  0.902272 -1.206037 0.727097
O  -1.363478 -1.621555 -1.922594
O  -0.025026 0.223793 -2.261241
O  2.738526 1.798235 1.401867
N  1.508926 2.088248 -0.55507
C  -1.910225 -0.766402 0.857848
C  -0.664987 -0.321845 0.045398
C  -3.20006 -0.072017 0.329591
C  -2.112396 -2.296487 0.96507
C  -3.15634 1.474521 0.302622
C  2.334579 -0.168333 -0.039147
C  -0.653659 -0.522283 -1.455916
C  3.64159 -0.797485 0.483102
C  -4.529482 2.093528 -0.037067
C  2.218362 1.318932 0.350814
C  4.882133 -0.233357 -0.246217
H  -1.719333 -0.37933 1.881475
H  -0.482224 0.751108 0.217145
H  -4.03506 -0.390014 0.986604
H  -3.438548 -0.459569 -0.681384
H  -2.329848 -2.741479 -0.019367
H  -2.96009 -2.508605 1.642365
H  -1.219107 -2.798214 1.378584
H  -2.815686 1.848931 1.289836
H  -2.410897 1.825038 -0.439523
H  2.246932 -0.2899 -1.133359
H  3.594775 -1.895578 0.350532
H  3.720878 -0.584762 1.564309
H  -4.887623 1.748081 -1.02537
H  -4.480314 3.197417 -0.062598
H  -5.28966 1.805772 0.713339
H  4.829865 -0.414282 -1.336464
H  4.978025 0.852992 -0.074575
H  5.800461 -0.716286 0.133318
H  -1.236163 -1.692548 -2.90883
H  1.41419 3.087152 -0.369879
H  1.059192 1.662924 -1.377212
